{
  "build": "latest",
  "workflowRunUrl": "https://github.com/openl-tablets/openl-tests/actions/runs/35256145939",
  "tests": [
    {
      "class": "tests.ui.webstudio.rules_editor.TestTestButtonAvailable",
      "method": "testTestButtonAvailable",
      "displayName": "testTestButtonAvailable",
      "suite": "rules_editor",
      "shard": "shard-06",
      "status": "FAILED",
      "durationMs": 162073,
      "testCaseId": "IPBQA-31701",
      "errorMessage": "[The button should read Test and carry the number of test tables after a refresh] \nexpected: \"6\"\n but was: \"3\"",
      "outcome": "FAILED",
      "knownIssue": "",
      "bundle": "debug/tests.ui.webstudio.rules_editor.TestTestButtonAvailable.testTestButtonAvailable.json"
    },
    {
      "class": "tests.ui.webstudio.repository.TestProjectCreatedMessageUi",
      "method": "testProjectCreationSaysSo",
      "displayName": "testProjectCreationSaysSo",
      "suite": "repository",
      "shard": "shard-01",
      "status": "FAILED",
      "durationMs": 48351,
      "testCaseId": "EPBDS-16652",
      "errorMessage": "[Creating a project should be confirmed the way copying and deleting one are] \nExpecting value to be true but was false",
      "outcome": "KNOWN ISSUE",
      "knownIssue": "EPBDS-16652",
      "bundle": "debug/tests.ui.webstudio.repository.TestProjectCreatedMessageUi.testProjectCreationSaysSo.json"
    },
    {
      "class": "tests.ui.webstudio.repository.TestDeployProjectWithoutDescriptorUi",
      "method": "testDeployWorksForAProjectWithoutDescriptor",
      "displayName": "testDeployWorksForAProjectWithoutDescriptor",
      "suite": "repository",
      "shard": "shard-09",
      "status": "FAILED",
      "durationMs": 60977,
      "testCaseId": "EPBDS-16641",
      "errorMessage": "[The deployment should stand among the deployments] \nExpecting ListN:\n  []\nto contain:\n  [\"Deploy-591762\"]\nbut could not find the following element(s):\n  [\"Deploy-591762\"]\n",
      "outcome": "KNOWN ISSUE",
      "knownIssue": "EPBDS-16641",
      "bundle": "debug/tests.ui.webstudio.repository.TestDeployProjectWithoutDescriptorUi.testDeployWorksForAProjectWithoutDescriptor.json"
    },
    {
      "class": "tests.ui.webstudio.repository.TestMigrateLegacyProjectUi",
      "method": "testMigrateMovesRootWorkbookOfAProjectWithoutDescriptor",
      "displayName": "testMigrateMovesRootWorkbookOfAProjectWithoutDescriptor",
      "suite": "repository",
      "shard": "shard-12",
      "status": "FAILED",
      "durationMs": 108429,
      "testCaseId": "IPBQA-33027",
      "errorMessage": "Condition not met after 60000ms timeout: Waiting for the card to stop offering a move it has already made",
      "outcome": "KNOWN ISSUE",
      "knownIssue": "EPBDS-16666",
      "bundle": "debug/tests.ui.webstudio.repository.TestMigrateLegacyProjectUi.testMigrateMovesRootWorkbookOfAProjectWithoutDescriptor.json"
    },
    {
      "class": "tests.ui.webstudio.repository.TestDeployProjectMessagesAndValidationUi",
      "method": "testDeploySuccessMessageNamesTheProject",
      "displayName": "testDeploySuccessMessageNamesTheProject",
      "suite": "repository",
      "shard": "shard-16",
      "status": "FAILED",
      "durationMs": 47193,
      "testCaseId": "EPBDS-16273",
      "errorMessage": "[The deploy notification must not name the removed \"Deploy Configuration\" feature] \nExpecting actual:\n  \"Deploy Configuration addedThe deployment configuration has been successfully added.\"\nnot to contain:\n  \"Deploy Configuration\"\n",
      "outcome": "KNOWN ISSUE",
      "knownIssue": "EPBDS-16273",
      "bundle": "debug/tests.ui.webstudio.repository.TestDeployProjectMessagesAndValidationUi.testDeploySuccessMessageNamesTheProject.json"
    },
    {
      "class": "tests.ui.webstudio.repository.TestDeployProjectMessagesAndValidationUi",
      "method": "testDeploymentNameRejectsForbiddenCharacters",
      "displayName": "testDeploymentNameRejectsForbiddenCharacters",
      "suite": "repository",
      "shard": "shard-16",
      "status": "FAILED",
      "durationMs": 66031,
      "testCaseId": "EPBDS-16271",
      "errorMessage": "[The refusal should name the problem with the deployment name] \nExpecting actual not to be empty",
      "outcome": "KNOWN ISSUE",
      "knownIssue": "EPBDS-16271",
      "bundle": "debug/tests.ui.webstudio.repository.TestDeployProjectMessagesAndValidationUi.testDeploymentNameRejectsForbiddenCharacters.json"
    },
    {
      "class": "tests.ui.webstudio.repository.TestProjectWithoutDescriptorUi",
      "method": "testCopyToBranchWorksForAProjectWithoutDescriptor",
      "displayName": "testCopyToBranchWorksForAProjectWithoutDescriptor",
      "suite": "repository",
      "shard": "shard-16",
      "status": "FAILED",
      "durationMs": 51456,
      "testCaseId": "EPBDS-16639",
      "errorMessage": "[Copying the project to a branch should not be refused] \nExpecting empty but was: \"Failed to update project status.\"",
      "outcome": "KNOWN ISSUE",
      "knownIssue": "EPBDS-16639",
      "bundle": "debug/tests.ui.webstudio.repository.TestProjectWithoutDescriptorUi.testCopyToBranchWorksForAProjectWithoutDescriptor.json"
    },
    {
      "class": "tests.ui.webstudio.repository.TestProjectWithoutDescriptorUi",
      "method": "testManagementTabOpensForAProjectWithoutDescriptor",
      "displayName": "testManagementTabOpensForAProjectWithoutDescriptor",
      "suite": "repository",
      "shard": "shard-16",
      "status": "FAILED",
      "durationMs": 54180,
      "testCaseId": "EPBDS-16638",
      "errorMessage": "[Opening the Management tab should read the roles, not answer 404] \nExpecting value to be false but was true",
      "outcome": "KNOWN ISSUE",
      "knownIssue": "EPBDS-16638",
      "bundle": "debug/tests.ui.webstudio.repository.TestProjectWithoutDescriptorUi.testManagementTabOpensForAProjectWithoutDescriptor.json"
    },
    {
      "class": "tests.ui.webstudio.repository.TestMigrateAfterDeployConfigEditUi",
      "method": "testMigrateIsNotOfferedAgainAfterEditingTheDeployConfig",
      "displayName": "testMigrateIsNotOfferedAgainAfterEditingTheDeployConfig",
      "suite": "repository",
      "shard": "shard-19",
      "status": "FAILED",
      "durationMs": 54324,
      "testCaseId": "EPBDS-16657",
      "errorMessage": "[Writing the deploy configuration through the studio should leave nothing to migrate] \nExpecting value to be false but was true",
      "outcome": "KNOWN ISSUE",
      "knownIssue": "EPBDS-16657",
      "bundle": "debug/tests.ui.webstudio.repository.TestMigrateAfterDeployConfigEditUi.testMigrateIsNotOfferedAgainAfterEditingTheDeployConfig.json"
    },
    {
      "class": "tests.ui.webstudio.repository.TestProjectNameValidationUi",
      "method": "testSlashNameShowsSpecificValidationMessage",
      "displayName": "testSlashNameShowsSpecificValidationMessage",
      "suite": "repository",
      "shard": "shard-19",
      "status": "FAILED",
      "durationMs": 30129,
      "testCaseId": "IPBQA-33037",
      "errorMessage": "[A name with '/' must be rejected with the specific forbidden-characters message, not a generic API error (EPBDS-16439)] \nExpecting actual:\n  \"Something went wrong on API server!\"\nto contain:\n  \"forbidden characters\" ",
      "outcome": "KNOWN ISSUE",
      "knownIssue": "EPBDS-16439",
      "bundle": "debug/tests.ui.webstudio.repository.TestProjectNameValidationUi.testSlashNameShowsSpecificValidationMessage.json"
    },
    {
      "class": "tests.ui.webstudio.rules_editor.TestAddAndDeleteProperty",
      "method": "testAddAndDeleteProperty",
      "displayName": "testAddAndDeleteProperty",
      "suite": "rules_editor",
      "shard": "shard-05",
      "status": "FAILED",
      "durationMs": 69751,
      "testCaseId": "IPBQA-25857",
      "errorMessage": "'Description' was not among what the list offered: [TypeExcel SheetCategoryCategory DetailedCategory Inversed, TypeExcel SheetCategoryCategory DetailedCategory Inversed, TypeExcel SheetCategoryCategory DetailedCategory Inversed, No data]",
      "outcome": "KNOWN ISSUE",
      "knownIssue": "EPBDS-16664",
      "bundle": "debug/tests.ui.webstudio.rules_editor.TestAddAndDeleteProperty.testAddAndDeleteProperty.json"
    },
    {
      "class": "tests.ui.webstudio.rules_editor.TestLocalChangesAfterReImportForTemplateProject",
      "method": "testLocalChangesAfterReImportForTemplateProject",
      "displayName": "testLocalChangesAfterReImportForTemplateProject",
      "suite": "rules_editor",
      "shard": "shard-16",
      "status": "FAILED",
      "durationMs": 85569,
      "testCaseId": "IPBQA-31512",
      "errorMessage": "[Changes title should show 1 local change for AutoPolicyTests] \nexpected: 1\n but was: 0",
      "outcome": "KNOWN ISSUE",
      "knownIssue": "EPBDS-16661",
      "bundle": "debug/tests.ui.webstudio.rules_editor.TestLocalChangesAfterReImportForTemplateProject.testLocalChangesAfterReImportForTemplateProject.json"
    },
    {
      "class": "tests.ui.webstudio.rules_editor.TestOrderingModeTableList",
      "method": "testTableListOrdering2",
      "displayName": "testTableListOrdering2",
      "suite": "rules_editor",
      "shard": "shard-16",
      "status": "FAILED",
      "durationMs": 45109,
      "testCaseId": "IPBQA-32507",
      "errorMessage": "[The utility tables of the sheet should be reachable from the module screen, which is what the 'Hide Utility Tables' filter of the old tree turned on and off] \nExpecting ListN:\n  [\"_MyRules\", \"Atable\", \"MyRules\", \"MyRules\"]\nto contain:\n  [\"Test123\"]\nbut could not find the following element(s):\n  [\"Test123\"]\n",
      "outcome": "KNOWN ISSUE",
      "knownIssue": "EPBDS-16665",
      "bundle": "debug/tests.ui.webstudio.rules_editor.TestOrderingModeTableList.testTableListOrdering2.json"
    },
    {
      "class": "tests.ui.webstudio.rules_editor.TestCompareExcelFiles",
      "method": "testCompareExcelFiles",
      "displayName": "testCompareExcelFiles",
      "suite": "rules_editor",
      "shard": "shard-17",
      "status": "FAILED",
      "durationMs": 66882,
      "testCaseId": "IPBQA-28380",
      "errorMessage": "['Compare Excel files' must open the comparison of two workbooks the reader uploads] \nExpecting value to be true but was false",
      "outcome": "KNOWN ISSUE",
      "knownIssue": "EPBDS-16655",
      "bundle": "debug/tests.ui.webstudio.rules_editor.TestCompareExcelFiles.testCompareExcelFiles.json"
    },
    {
      "class": "tests.ui.webstudio.rules_editor.TestOrderingModeDefaults",
      "method": "testDefaultOrderForMultiUser",
      "displayName": "testDefaultOrderForMultiUser",
      "suite": "rules_editor",
      "shard": "shard-17",
      "status": "FAILED",
      "durationMs": 86059,
      "testCaseId": "IPBQA-32117",
      "errorMessage": "[The Type view should group the tables by their kind, Vocabulary among them] \nExpecting ListN:\n  [\"Datatype\", \"Rules\", \"Spreadsheet\", \"Test\"]\nto contain:\n  [\"Rules\", \"Spreadsheet\", \"Test\", \"Datatype\", \"Vocabulary\"]\nbut could not find the following element(s):\n  [\"Vocabulary\"]\n",
      "outcome": "KNOWN ISSUE",
      "knownIssue": "EPBDS-16654",
      "bundle": "debug/tests.ui.webstudio.rules_editor.TestOrderingModeDefaults.testDefaultOrderForMultiUser.json"
    },
    {
      "class": "tests.ui.webstudio.studio_issues.TestDisplayChangedRowsCompareScreens",
      "method": "testDisplayChangedRowsUploadedFilesCompareScreen",
      "displayName": "testDisplayChangedRowsUploadedFilesCompareScreen",
      "suite": "studio_issues",
      "shard": "shard-01",
      "status": "FAILED",
      "durationMs": 63486,
      "testCaseId": "IPBQA-32105",
      "errorMessage": "['Compare Excel files' must open the comparison of two workbooks the reader uploads] \nExpecting value to be true but was false",
      "outcome": "KNOWN ISSUE",
      "knownIssue": "EPBDS-16655",
      "bundle": "debug/tests.ui.webstudio.studio_issues.TestDisplayChangedRowsCompareScreens.testDisplayChangedRowsUploadedFilesCompareScreen.json"
    },
    {
      "class": "tests.ui.webstudio.studio_issues.TestGenerateOpenApiDefaultDate",
      "method": "testCardNamesTheSpecificationJustGenerated",
      "displayName": "testCardNamesTheSpecificationJustGenerated",
      "suite": "studio_issues",
      "shard": "shard-02",
      "status": "FAILED",
      "durationMs": 40921,
      "testCaseId": "EPBDS-16656",
      "errorMessage": "[The card should name the specification the generation has just written] \nExpecting value to be false but was true",
      "outcome": "KNOWN ISSUE",
      "knownIssue": "EPBDS-16656",
      "bundle": "debug/tests.ui.webstudio.studio_issues.TestGenerateOpenApiDefaultDate.testCardNamesTheSpecificationJustGenerated.json"
    },
    {
      "class": "tests.ui.webstudio.studio_issues.TestClickOnErrorFromTheBottom",
      "method": "testClickOnErrorFromTheBottom",
      "displayName": "testClickOnErrorFromTheBottom",
      "suite": "studio_issues",
      "shard": "shard-06",
      "status": "FAILED",
      "durationMs": 105440,
      "testCaseId": "EPBDS-9309",
      "errorMessage": "[Listing the tables of a module that holds a table without a body must not answer a server error] \nExpecting empty but was: [\"500 http://appcontainer-299970:8080/web/projects/ZGVzaWduOnByb2plY3QtNTI4MDIyOjc5ZTdmZDk5YjA3YjQwMWUxNmIwZGNmZTViNDU2MDVmZTAxZTczYzEwOGY2OWM3OTc3MzAwMDM4M2U3N2M1NjA=/tables?module=ContextDatatypes&unpaged=true\"]",
      "outcome": "KNOWN ISSUE",
      "knownIssue": "EPBDS-16662",
      "bundle": "debug/tests.ui.webstudio.studio_issues.TestClickOnErrorFromTheBottom.testClickOnErrorFromTheBottom.json"
    },
    {
      "class": "tests.ui.webstudio.studio_issues.TestNoConflictsWhileRunningTestsUi",
      "method": "testRunningTestsIsNotRefusedWithConflict",
      "displayName": "testRunningTestsIsNotRefusedWithConflict",
      "suite": "studio_issues",
      "shard": "shard-10",
      "status": "FAILED",
      "durationMs": 49025,
      "testCaseId": "EPBDS-16636",
      "errorMessage": "[Reading the results of the tests the reader ran should not be refused as a conflict] \nExpecting empty but was: [\"GET http://appcontainer-446590:8080/web/projects/ZGVzaWduOnByb2plY3QtNzM2MzcwOmMxYjJkYWZjZWE3ODg5NzVkZWM3NmIxZjNjNjlkNjdmYjJiYTgyMGFkZTU3YzE1N2M1MTUzOTE3MzczOTk3ZWM=/tests/summary?failuresOnly=false&failures=5&compoundResult=false&lazyValues=true&page=0&size=5\"]",
      "outcome": "KNOWN ISSUE",
      "knownIssue": "EPBDS-16636",
      "bundle": "debug/tests.ui.webstudio.studio_issues.TestNoConflictsWhileRunningTestsUi.testRunningTestsIsNotRefusedWithConflict.json"
    },
    {
      "class": "tests.ui.webstudio.studio_issues.TestWithinCurrentModuleOnlyAfterModuleSwitch",
      "method": "testWithinCurrentModuleOnlyStaysOfferedAfterSwitchingModule",
      "displayName": "testWithinCurrentModuleOnlyStaysOfferedAfterSwitchingModule",
      "suite": "studio_issues",
      "shard": "shard-10",
      "status": "FAILED",
      "durationMs": 53700,
      "testCaseId": "EPBDS-16653",
      "errorMessage": "[The box should be offered on the module the reader moved to] \nExpecting value to be true but was false",
      "outcome": "KNOWN ISSUE",
      "knownIssue": "EPBDS-16653",
      "bundle": "debug/tests.ui.webstudio.studio_issues.TestWithinCurrentModuleOnlyAfterModuleSwitch.testWithinCurrentModuleOnlyStaysOfferedAfterSwitchingModule.json"
    },
    {
      "class": "tests.ui.webstudio.studio_issues.TestArrayOfAliasValuesInRunTrace",
      "method": "testArrayOfAliasValuesInRunTrace",
      "displayName": "testArrayOfAliasValuesInRunTrace",
      "suite": "studio_issues",
      "shard": "shard-11",
      "status": "FAILED",
      "durationMs": 51183,
      "testCaseId": "EPBDS-7796",
      "errorMessage": "[The element of the array should be written by picking from the values of the alias datatype in the Run menu for table: myRule2] \nExpecting value to be true but was false",
      "outcome": "KNOWN ISSUE",
      "knownIssue": "EPBDS-16660",
      "bundle": "debug/tests.ui.webstudio.studio_issues.TestArrayOfAliasValuesInRunTrace.testArrayOfAliasValuesInRunTrace.json"
    },
    {
      "class": "tests.ui.webstudio.studio_issues.TestRunTableResultUi",
      "method": "testRunTableReportsItsResults",
      "displayName": "testRunTableReportsItsResults",
      "suite": "studio_issues",
      "shard": "shard-11",
      "status": "FAILED",
      "durationMs": 86898,
      "testCaseId": "EPBDS-16635",
      "errorMessage": "[A Run table should report the value each of its runs returned, and the window shows none] \nExpecting actual:\n  0\nto be greater than:\n  0\n",
      "outcome": "KNOWN ISSUE",
      "knownIssue": "EPBDS-16635",
      "bundle": "debug/tests.ui.webstudio.studio_issues.TestRunTableResultUi.testRunTableReportsItsResults.json"
    },
    {
      "class": "tests.ui.webstudio.studio_smoke.TestAdminNotifications",
      "method": "testNotifications",
      "displayName": "testNotifications",
      "suite": "studio_smoke",
      "shard": "shard-03",
      "status": "FAILED",
      "durationMs": 134763,
      "testCaseId": "IPBQA-30617",
      "errorMessage": "\nExpecting value to be false but was true",
      "outcome": "KNOWN ISSUE",
      "knownIssue": "EPBDS-15703",
      "bundle": "debug/tests.ui.webstudio.studio_smoke.TestAdminNotifications.testNotifications.json"
    },
    {
      "class": "tests.ui.webstudio.studio_smoke.TestAdminSystemSettings",
      "method": "testSystemSettings",
      "displayName": "testSystemSettings",
      "suite": "studio_smoke",
      "shard": "shard-10",
      "status": "FAILED",
      "durationMs": 248841,
      "testCaseId": "IPBQA-30651",
      "errorMessage": "\nExpecting ArrayList:\n  []\nto contain:\n  [\"Number of threads must be positive integer\"]\nbut could not find the following element(s):\n  [\"Number of threads must be positive integer\"]\n",
      "outcome": "KNOWN ISSUE",
      "knownIssue": "EPBDS-15704",
      "bundle": "debug/tests.ui.webstudio.studio_smoke.TestAdminSystemSettings.testSystemSettings.json"
    },
    {
      "class": "tests.ui.webstudio.ad.TestAdAuthUi",
      "method": "testAdLoginLogoutAndUserSwitch",
      "displayName": "testAdLoginLogoutAndUserSwitch",
      "suite": "ad",
      "shard": "shard-01",
      "status": "PASSED",
      "durationMs": 65422,
      "testCaseId": "",
      "errorMessage": "",
      "outcome": "PASSED",
      "knownIssue": "",
      "bundle": ""
    },
    {
      "class": "tests.ui.webstudio.ad.TestPersonalAccessTokenAdUi",
      "method": "testPersonalAccessTokenAuthenticatesRestInAdMode",
      "displayName": "testPersonalAccessTokenAuthenticatesRestInAdMode",
      "suite": "ad",
      "shard": "shard-19",
      "status": "PASSED",
      "durationMs": 31538,
      "testCaseId": "EPBDS-16168",
      "errorMessage": "",
      "outcome": "PASSED",
      "knownIssue": "",
      "bundle": ""
    },
    {
      "class": "tests.ui.webstudio.git.TestProtectedBranchMergeProtection",
      "method": "testCannotMergeIntoProtectedBranch",
      "displayName": "testCannotMergeIntoProtectedBranch",
      "suite": "git",
      "shard": "shard-01",
      "status": "PASSED",
      "durationMs": 110185,
      "testCaseId": "EPBDS-15753",
      "errorMessage": "",
      "outcome": "PASSED",
      "knownIssue": "",
      "bundle": ""
    },
    {
      "class": "tests.ui.webstudio.git.TestDeleteBranchLastProjectCopyUi",
      "method": "testDeletingLastProjectBranchWarnsAndDeletesTheProject",
      "displayName": "testDeletingLastProjectBranchWarnsAndDeletesTheProject",
      "suite": "git",
      "shard": "shard-02",
      "status": "PASSED",
      "durationMs": 62014,
      "testCaseId": "IPBQA-33016",
      "errorMessage": "",
      "outcome": "PASSED",
      "knownIssue": "",
      "bundle": ""
    },
    {
      "class": "tests.ui.webstudio.git.TestProtectedBranchBypassLegacyEditorUi",
      "method": "testContributorCannotEditOnProtectedBranchLegacy",
      "displayName": "testContributorCannotEditOnProtectedBranchLegacy",
      "suite": "git",
      "shard": "shard-02",
      "status": "PASSED",
      "durationMs": 47466,
      "testCaseId": "EPBDS-15960",
      "errorMessage": "",
      "outcome": "PASSED",
      "knownIssue": "",
      "bundle": ""
    },
    {
      "class": "tests.ui.webstudio.git.TestProtectedBranchBypassLegacyEditorUi",
      "method": "testEligibleManagerCanEditOnProtectedBranchLegacy",
      "displayName": "testEligibleManagerCanEditOnProtectedBranchLegacy",
      "suite": "git",
      "shard": "shard-02",
      "status": "PASSED",
      "durationMs": 27837,
      "testCaseId": "EPBDS-15960",
      "errorMessage": "",
      "outcome": "PASSED",
      "knownIssue": "",
      "bundle": ""
    },
    {
      "class": "tests.ui.webstudio.git.TestMergeConflictDeletedFileUi",
      "method": "deletedSideOffersNoDownloadLink",
      "displayName": "deletedSideOffersNoDownloadLink",
      "suite": "git",
      "shard": "shard-03",
      "status": "PASSED",
      "durationMs": 92215,
      "testCaseId": "EPBDS-16574",
      "errorMessage": "",
      "outcome": "PASSED",
      "knownIssue": "",
      "bundle": ""
    },
    {
      "class": "tests.ui.webstudio.git.TestDeleteBranchLockedByOtherUserUi",
      "method": "testBranchLockedByAnotherUserIsNotDeletable",
      "displayName": "testBranchLockedByAnotherUserIsNotDeletable",
      "suite": "git",
      "shard": "shard-04",
      "status": "PASSED",
      "durationMs": 103372,
      "testCaseId": "IPBQA-33017",
      "errorMessage": "",
      "outcome": "PASSED",
      "knownIssue": "",
      "bundle": ""
    },
    {
      "class": "tests.ui.webstudio.git.TestGitSortingExcelFilesInComparePopUp",
      "method": "testGitSortingExcelFilesInComparePopUp",
      "displayName": "testGitSortingExcelFilesInComparePopUp",
      "suite": "git",
      "shard": "shard-05",
      "status": "PASSED",
      "durationMs": 43654,
      "testCaseId": "IPBQA-27534",
      "errorMessage": "",
      "outcome": "PASSED",
      "knownIssue": "",
      "bundle": ""
    },
    {
      "class": "tests.ui.webstudio.git.TestProtectedBranchBypassManagerMergeUi",
      "method": "testManagerBypassMergeFlowUi",
      "displayName": "testManagerBypassMergeFlowUi",
      "suite": "git",
      "shard": "shard-05",
      "status": "PASSED",
      "durationMs": 35785,
      "testCaseId": "EPBDS-15960",
      "errorMessage": "",
      "outcome": "PASSED",
      "knownIssue": "",
      "bundle": ""
    },
    {
      "class": "tests.ui.webstudio.git.TestMergeBranchesWithConflicts",
      "method": "testMergeBranchesWithConflictsExportUseYours",
      "displayName": "testMergeBranchesWithConflictsExportUseYours",
      "suite": "git",
      "shard": "shard-06",
      "status": "PASSED",
      "durationMs": 105972,
      "testCaseId": "IPBQA-32850",
      "errorMessage": "",
      "outcome": "PASSED",
      "knownIssue": "",
      "bundle": ""
    },
    {
      "class": "tests.ui.webstudio.git.TestMergeBranchesWithConflicts",
      "method": "testMergeBranchesWithConflictsImportUseTheirs",
      "displayName": "testMergeBranchesWithConflictsImportUseTheirs",
      "suite": "git",
      "shard": "shard-06",
      "status": "PASSED",
      "durationMs": 104289,
      "testCaseId": "IPBQA-32851",
      "errorMessage": "",
      "outcome": "PASSED",
      "knownIssue": "",
      "bundle": ""
    },
    {
      "class": "tests.ui.webstudio.git.TestGitStatusCopyClosedProject",
      "method": "testGitStatusCopyClosedProject",
      "displayName": "testGitStatusCopyClosedProject",
      "suite": "git",
      "shard": "shard-07",
      "status": "PASSED",
      "durationMs": 50867,
      "testCaseId": "IPBQA-27562",
      "errorMessage": "",
      "outcome": "PASSED",
      "knownIssue": "",
      "bundle": ""
    },
    {
      "class": "tests.ui.webstudio.git.TestReactBranchesSmoke",
      "method": "createBranchAndOpenMergeDialog",
      "displayName": "createBranchAndOpenMergeDialog",
      "suite": "git",
      "shard": "shard-07",
      "status": "PASSED",
      "durationMs": 48897,
      "testCaseId": "",
      "errorMessage": "",
      "outcome": "PASSED",
      "knownIssue": "",
      "bundle": ""
    },
    {
      "class": "tests.ui.webstudio.git.TestGitNewBranchCreatedFromMaster",
      "method": "testGitNewBranchCreatedFromMaster",
      "displayName": "testGitNewBranchCreatedFromMaster",
      "suite": "git",
      "shard": "shard-08",
      "status": "PASSED",
      "durationMs": 59339,
      "testCaseId": "EPBDS-8421",
      "errorMessage": "",
      "outcome": "PASSED",
      "knownIssue": "",
      "bundle": ""
    },
    {
      "class": "tests.ui.webstudio.git.TestReactMergeConflictSmoke",
      "method": "resolveConflictUseYoursKeepsMasterVersion",
      "displayName": "resolveConflictUseYoursKeepsMasterVersion",
      "suite": "git",
      "shard": "shard-08",
      "status": "PASSED",
      "durationMs": 71446,
      "testCaseId": "",
      "errorMessage": "",
      "outcome": "PASSED",
      "knownIssue": "",
      "bundle": ""
    },
    {
      "class": "tests.ui.webstudio.git.TestGitCopyProjectIntoExistingBranchViaRepositoryTab",
      "method": "testGitCopyProjectIntoExistingBranchRepositoryTab",
      "displayName": "testGitCopyProjectIntoExistingBranchRepositoryTab",
      "suite": "git",
      "shard": "shard-09",
      "status": "PASSED",
      "durationMs": 81065,
      "testCaseId": "EPBDS-8495",
      "errorMessage": "",
      "outcome": "PASSED",
      "knownIssue": "",
      "bundle": ""
    },
    {
      "class": "tests.ui.webstudio.git.TestGitSwitchToDeletedBranch",
      "method": "testGitSwitchToDeletedBranch",
      "displayName": "testGitSwitchToDeletedBranch",
      "suite": "git",
      "shard": "shard-10",
      "status": "PASSED",
      "durationMs": 34549,
      "testCaseId": "EPBDS-8505",
      "errorMessage": "",
      "outcome": "PASSED",
      "knownIssue": "",
      "bundle": ""
    },
    {
      "class": "tests.ui.webstudio.git.TestProtectedBranchBypassSettingOffUi",
      "method": "testManagerBlockedWhenBypassSettingOff",
      "displayName": "testManagerBlockedWhenBypassSettingOff",
      "suite": "git",
      "shard": "shard-10",
      "status": "PASSED",
      "durationMs": 39680,
      "testCaseId": "EPBDS-15960",
      "errorMessage": "",
      "outcome": "PASSED",
      "knownIssue": "",
      "bundle": ""
    },
    {
      "class": "tests.ui.webstudio.git.TestGitBranchSwitching",
      "method": "testGitBranchSwitching",
      "displayName": "testGitBranchSwitching",
      "suite": "git",
      "shard": "shard-11",
      "status": "PASSED",
      "durationMs": 52932,
      "testCaseId": "IPBQA-27450",
      "errorMessage": "",
      "outcome": "PASSED",
      "knownIssue": "",
      "bundle": ""
    },
    {
      "class": "tests.ui.webstudio.git.TestProtectedBranchBypassIdempotentRetryUi",
      "method": "testBypassMergeIsIdempotent",
      "displayName": "testBypassMergeIsIdempotent",
      "suite": "git",
      "shard": "shard-11",
      "status": "PASSED",
      "durationMs": 44636,
      "testCaseId": "EPBDS-15960",
      "errorMessage": "",
      "outcome": "PASSED",
      "knownIssue": "",
      "bundle": ""
    },
    {
      "class": "tests.ui.webstudio.git.TestGitSwitchBranchProjectWithoutChanges",
      "method": "testGitSwitchBranchProjectWithoutChanges",
      "displayName": "testGitSwitchBranchProjectWithoutChanges",
      "suite": "git",
      "shard": "shard-12",
      "status": "PASSED",
      "durationMs": 57712,
      "testCaseId": "EPBDS-8453, EPBDS-8424",
      "errorMessage": "",
      "outcome": "PASSED",
      "knownIssue": "",
      "bundle": ""
    },
    {
      "class": "tests.ui.webstudio.git.TestDeleteBranchDialogUi",
      "method": "testDeleteBranchRemovesBranchAndFallsBackToDefault",
      "displayName": "testDeleteBranchRemovesBranchAndFallsBackToDefault",
      "suite": "git",
      "shard": "shard-13",
      "status": "PASSED",
      "durationMs": 50181,
      "testCaseId": "IPBQA-33015",
      "errorMessage": "",
      "outcome": "PASSED",
      "knownIssue": "",
      "bundle": ""
    },
    {
      "class": "tests.ui.webstudio.git.TestProtectedBranchBypassCancelMergeUi",
      "method": "testCancelOnBypassConfirmAbortsTheMerge",
      "displayName": "testCancelOnBypassConfirmAbortsTheMerge",
      "suite": "git",
      "shard": "shard-13",
      "status": "PASSED",
      "durationMs": 32749,
      "testCaseId": "EPBDS-15960",
      "errorMessage": "",
      "outcome": "PASSED",
      "knownIssue": "",
      "bundle": ""
    },
    {
      "class": "tests.ui.webstudio.git.TestDeleteBranchOfferLogicUi",
      "method": "testDeleteBranchNotOfferedOnDefaultBranch",
      "displayName": "testDeleteBranchNotOfferedOnDefaultBranch",
      "suite": "git",
      "shard": "shard-14",
      "status": "PASSED",
      "durationMs": 48858,
      "testCaseId": "IPBQA-33018",
      "errorMessage": "",
      "outcome": "PASSED",
      "knownIssue": "",
      "bundle": ""
    },
    {
      "class": "tests.ui.webstudio.git.TestDeleteBranchOfferLogicUi",
      "method": "testDeleteBranchNotOfferedOnProtectedBranch",
      "displayName": "testDeleteBranchNotOfferedOnProtectedBranch",
      "suite": "git",
      "shard": "shard-14",
      "status": "PASSED",
      "durationMs": 54528,
      "testCaseId": "IPBQA-33019",
      "errorMessage": "",
      "outcome": "PASSED",
      "knownIssue": "",
      "bundle": ""
    },
    {
      "class": "tests.ui.webstudio.git.TestGitCopyProjectIntoExistingBranchViaEditorTab",
      "method": "testGitCopyProjectIntoExistingBranchEditorTab",
      "displayName": "testGitCopyProjectIntoExistingBranchEditorTab",
      "suite": "git",
      "shard": "shard-15",
      "status": "PASSED",
      "durationMs": 79984,
      "testCaseId": "EPBDS-8495",
      "errorMessage": "",
      "outcome": "PASSED",
      "knownIssue": "",
      "bundle": ""
    },
    {
      "class": "tests.ui.webstudio.git.TestReactMergeSmoke",
      "method": "receiveMergesBranchIntoMaster",
      "displayName": "receiveMergesBranchIntoMaster",
      "suite": "git",
      "shard": "shard-15",
      "status": "PASSED",
      "durationMs": 65398,
      "testCaseId": "",
      "errorMessage": "",
      "outcome": "PASSED",
      "knownIssue": "",
      "bundle": ""
    },
    {
      "class": "tests.ui.webstudio.git.TestMergeDialogLongBranchLayoutUi",
      "method": "longBranchNameKeepsTheSyncDialogIntact",
      "displayName": "longBranchNameKeepsTheSyncDialogIntact",
      "suite": "git",
      "shard": "shard-16",
      "status": "PASSED",
      "durationMs": 50330,
      "testCaseId": "EPBDS-16574",
      "errorMessage": "",
      "outcome": "PASSED",
      "knownIssue": "",
      "bundle": ""
    },
    {
      "class": "tests.ui.webstudio.git.TestGitSwitchDeletedBranchPreset",
      "method": "testGitSwitchDeletedBranchPreset",
      "displayName": "testGitSwitchDeletedBranchPreset",
      "suite": "git",
      "shard": "shard-17",
      "status": "PASSED",
      "durationMs": 78868,
      "testCaseId": "EPBDS-8520",
      "errorMessage": "",
      "outcome": "PASSED",
      "knownIssue": "",
      "bundle": ""
    },
    {
      "class": "tests.ui.webstudio.git.TestMergeBranchesNoConflicts",
      "method": "testMergeBranchesNoConflicts",
      "displayName": "testMergeBranchesNoConflicts",
      "suite": "git",
      "shard": "shard-18",
      "status": "PASSED",
      "durationMs": 243335,
      "testCaseId": "IPBQA-29455",
      "errorMessage": "",
      "outcome": "PASSED",
      "knownIssue": "",
      "bundle": ""
    },
    {
      "class": "tests.ui.webstudio.git.TestProtectedBranchBypassContributorBlockedUi",
      "method": "testContributorSeesErrorInsteadOfBypassConfirm",
      "displayName": "testContributorSeesErrorInsteadOfBypassConfirm",
      "suite": "git",
      "shard": "shard-19",
      "status": "PASSED",
      "durationMs": 38981,
      "testCaseId": "EPBDS-15960",
      "errorMessage": "",
      "outcome": "PASSED",
      "knownIssue": "",
      "bundle": ""
    },
    {
      "class": "tests.ui.webstudio.git.TestProtectedBranchBypassBothProtectedUi",
      "method": "testBothProtectedBranchesShowBothCopy",
      "displayName": "testBothProtectedBranchesShowBothCopy",
      "suite": "git",
      "shard": "shard-20",
      "status": "PASSED",
      "durationMs": 32711,
      "testCaseId": "EPBDS-15960",
      "errorMessage": "",
      "outcome": "PASSED",
      "knownIssue": "",
      "bundle": ""
    },
    {
      "class": "tests.ui.webstudio.repository.TestUploadModulePreservesExistingUi",
      "method": "testUploadingExcelKeepsExistingModules",
      "displayName": "testUploadingExcelKeepsExistingModules",
      "suite": "repository",
      "shard": "shard-01",
      "status": "PASSED",
      "durationMs": 43570,
      "testCaseId": "EPBDS-16227",
      "errorMessage": "",
      "outcome": "PASSED",
      "knownIssue": "",
      "bundle": ""
    },
    {
      "class": "tests.ui.webstudio.repository.TestMigrateNotOfferedForFormattingOnlyUi",
      "method": "testFormattingOnlyDescriptorGetsEditNotMigrate",
      "displayName": "testFormattingOnlyDescriptorGetsEditNotMigrate",
      "suite": "repository",
      "shard": "shard-02",
      "status": "PASSED",
      "durationMs": 49793,
      "testCaseId": "IPBQA-33030",
      "errorMessage": "",
      "outcome": "PASSED",
      "knownIssue": "",
      "bundle": ""
    },
    {
      "class": "tests.ui.webstudio.repository.TestProjectOverviewEditKeepsModulesUi",
      "method": "testOverviewEditSaveKeepsModules",
      "displayName": "testOverviewEditSaveKeepsModules",
      "suite": "repository",
      "shard": "shard-02",
      "status": "PASSED",
      "durationMs": 40121,
      "testCaseId": "EPBDS-16327",
      "errorMessage": "",
      "outcome": "PASSED",
      "knownIssue": "",
      "bundle": ""
    },
    {
      "class": "tests.ui.webstudio.repository.TestDeploymentsEmptyStateUi",
      "method": "testDeploymentsAreClosedOffWithoutDeployRepository",
      "displayName": "testDeploymentsAreClosedOffWithoutDeployRepository",
      "suite": "repository",
      "shard": "shard-03",
      "status": "PASSED",
      "durationMs": 47695,
      "testCaseId": "IPBQA-33009",
      "errorMessage": "",
      "outcome": "PASSED",
      "knownIssue": "",
      "bundle": ""
    },
    {
      "class": "tests.ui.webstudio.repository.TestPermanentDeleteAfterRefreshUi",
      "method": "testDeletedFileDoesNotReturnAfterRefresh",
      "displayName": "testDeletedFileDoesNotReturnAfterRefresh",
      "suite": "repository",
      "shard": "shard-03",
      "status": "PASSED",
      "durationMs": 64174,
      "testCaseId": "EPBDS-15385",
      "errorMessage": "",
      "outcome": "PASSED",
      "knownIssue": "",
      "bundle": ""
    },
    {
      "class": "tests.ui.webstudio.repository.TestPermanentDeleteAfterRefreshUi",
      "method": "testPermanentlyDeletedProjectDoesNotReturnAfterRefresh",
      "displayName": "testPermanentlyDeletedProjectDoesNotReturnAfterRefresh",
      "suite": "repository",
      "shard": "shard-03",
      "status": "PASSED",
      "durationMs": 65572,
      "testCaseId": "EPBDS-15385",
      "errorMessage": "",
      "outcome": "PASSED",
      "knownIssue": "",
      "bundle": ""
    },
    {
      "class": "tests.ui.webstudio.repository.TestDeploymentConfigurationRepositoryConnectionMsSql",
      "method": "testDeploymentConfigurationRepositoryConnectionMsSql",
      "displayName": "testDeploymentConfigurationRepositoryConnectionMsSql",
      "suite": "repository",
      "shard": "shard-04",
      "status": "PASSED",
      "durationMs": 98614,
      "testCaseId": "",
      "errorMessage": "",
      "outcome": "PASSED",
      "knownIssue": "",
      "bundle": ""
    },
    {
      "class": "tests.ui.webstudio.repository.TestProjectDeleteUnsavedEditUi",
      "method": "testDeleteProjectWithUnsavedRulesEditSucceeds",
      "displayName": "testDeleteProjectWithUnsavedRulesEditSucceeds",
      "suite": "repository",
      "shard": "shard-04",
      "status": "PASSED",
      "durationMs": 69385,
      "testCaseId": "EPBDS-16229",
      "errorMessage": "",
      "outcome": "PASSED",
      "knownIssue": "",
      "bundle": ""
    },
    {
      "class": "tests.ui.webstudio.repository.TestDeploymentsListUi",
      "method": "testDeploymentsListSearchAndPaging",
      "displayName": "testDeploymentsListSearchAndPaging",
      "suite": "repository",
      "shard": "shard-05",
      "status": "PASSED",
      "durationMs": 114332,
      "testCaseId": "IPBQA-33012",
      "errorMessage": "",
      "outcome": "PASSED",
      "knownIssue": "",
      "bundle": ""
    },
    {
      "class": "tests.ui.webstudio.repository.TestReactSaveProjectSmoke",
      "method": "saveCommitsLocalChanges",
      "displayName": "saveCommitsLocalChanges",
      "suite": "repository",
      "shard": "shard-06",
      "status": "PASSED",
      "durationMs": 51116,
      "testCaseId": "",
      "errorMessage": "",
      "outcome": "PASSED",
      "knownIssue": "",
      "bundle": ""
    },
    {
      "class": "tests.ui.webstudio.repository.TestMainPageHasNoHorizontalScrollUi",
      "method": "testStudioPagesFitTheWindowWidth",
      "displayName": "testStudioPagesFitTheWindowWidth",
      "suite": "repository",
      "shard": "shard-07",
      "status": "PASSED",
      "durationMs": 9256,
      "testCaseId": "EPBDS-16274",
      "errorMessage": "",
      "outcome": "PASSED",
      "knownIssue": "",
      "bundle": ""
    },
    {
      "class": "tests.ui.webstudio.repository.TestMultipleDesignRepositoriesWithPostgres",
      "method": "testMultipleDesignRepositoriesWithPostgres",
      "displayName": "testMultipleDesignRepositoriesWithPostgres",
      "suite": "repository",
      "shard": "shard-07",
      "status": "PASSED",
      "durationMs": 159195,
      "testCaseId": "IPBQA-30859",
      "errorMessage": "",
      "outcome": "PASSED",
      "knownIssue": "",
      "bundle": ""
    },
    {
      "class": "tests.ui.webstudio.repository.TestMigrateKeepsFormatsAndFiltersUi",
      "method": "testMigrateKeepsXlsModuleAndMethodFilter",
      "displayName": "testMigrateKeepsXlsModuleAndMethodFilter",
      "suite": "repository",
      "shard": "shard-08",
      "status": "PASSED",
      "durationMs": 52681,
      "testCaseId": "IPBQA-33029",
      "errorMessage": "",
      "outcome": "PASSED",
      "knownIssue": "",
      "bundle": ""
    },
    {
      "class": "tests.ui.webstudio.repository.TestProjectNonAsciiNameDeepLinkUi",
      "method": "testNonAsciiNameRendersAndDeepLinkSurvivesRelogin",
      "displayName": "testNonAsciiNameRendersAndDeepLinkSurvivesRelogin",
      "suite": "repository",
      "shard": "shard-08",
      "status": "PASSED",
      "durationMs": 84825,
      "testCaseId": "IPBQA-33035",
      "errorMessage": "",
      "outcome": "PASSED",
      "knownIssue": "",
      "bundle": ""
    },
    {
      "class": "tests.ui.webstudio.repository.TestNewDeployPopup",
      "method": "testNewDeployPopup",
      "displayName": "testNewDeployPopup",
      "suite": "repository",
      "shard": "shard-09",
      "status": "PASSED",
      "durationMs": 316578,
      "testCaseId": "IPBQA-30049",
      "errorMessage": "",
      "outcome": "PASSED",
      "knownIssue": "",
      "bundle": ""
    },
    {
      "class": "tests.ui.webstudio.repository.TestFilesTabStaleSelectionUi",
      "method": "testSelectionOfDeletedFileIsDropped",
      "displayName": "testSelectionOfDeletedFileIsDropped",
      "suite": "repository",
      "shard": "shard-10",
      "status": "PASSED",
      "durationMs": 65639,
      "testCaseId": "IPBQA-33039",
      "errorMessage": "",
      "outcome": "PASSED",
      "knownIssue": "",
      "bundle": ""
    },
    {
      "class": "tests.ui.webstudio.repository.TestFilesTabStaleSelectionUi",
      "method": "testStaleDeepLinkSelectionIsDropped",
      "displayName": "testStaleDeepLinkSelectionIsDropped",
      "suite": "repository",
      "shard": "shard-10",
      "status": "PASSED",
      "durationMs": 43889,
      "testCaseId": "IPBQA-33040",
      "errorMessage": "",
      "outcome": "PASSED",
      "knownIssue": "",
      "bundle": ""
    },
    {
      "class": "tests.ui.webstudio.repository.TestLiveProjectsUpdatesUi",
      "method": "testChangesDuringReloadLeaveScreenInteractive",
      "displayName": "testChangesDuringReloadLeaveScreenInteractive",
      "suite": "repository",
      "shard": "shard-11",
      "status": "PASSED",
      "durationMs": 14687,
      "testCaseId": "IPBQA-33043",
      "errorMessage": "",
      "outcome": "PASSED",
      "knownIssue": "",
      "bundle": ""
    },
    {
      "class": "tests.ui.webstudio.repository.TestLiveProjectsUpdatesUi",
      "method": "testProjectsListPicksUpRestCreatedProjectWithoutReload",
      "displayName": "testProjectsListPicksUpRestCreatedProjectWithoutReload",
      "suite": "repository",
      "shard": "shard-11",
      "status": "PASSED",
      "durationMs": 32008,
      "testCaseId": "IPBQA-33042",
      "errorMessage": "",
      "outcome": "PASSED",
      "knownIssue": "",
      "bundle": ""
    },
    {
      "class": "tests.ui.webstudio.repository.TestProjectIdUrlSafeEncodingUi",
      "method": "testUrlSafeIdSurvivesFullProjectLifecycle",
      "displayName": "testUrlSafeIdSurvivesFullProjectLifecycle",
      "suite": "repository",
      "shard": "shard-11",
      "status": "PASSED",
      "durationMs": 76998,
      "testCaseId": "IPBQA-33034",
      "errorMessage": "",
      "outcome": "PASSED",
      "knownIssue": "",
      "bundle": ""
    },
    {
      "class": "tests.ui.webstudio.repository.TestDatatypeRoundTripUi",
      "method": "testReorderedTitledDatatypeSurvivesEditorRoundTrip",
      "displayName": "testReorderedTitledDatatypeSurvivesEditorRoundTrip",
      "suite": "repository",
      "shard": "shard-12",
      "status": "PASSED",
      "durationMs": 65941,
      "testCaseId": "IPBQA-33041",
      "errorMessage": "",
      "outcome": "PASSED",
      "knownIssue": "",
      "bundle": ""
    },
    {
      "class": "tests.ui.webstudio.repository.TestMigrateLegacyProjectUi",
      "method": "testMigrateRewritesLegacyDescriptorAndKeepsModules",
      "displayName": "testMigrateRewritesLegacyDescriptorAndKeepsModules",
      "suite": "repository",
      "shard": "shard-12",
      "status": "PASSED",
      "durationMs": 60160,
      "testCaseId": "IPBQA-33027",
      "errorMessage": "",
      "outcome": "PASSED",
      "knownIssue": "",
      "bundle": ""
    },
    {
      "class": "tests.ui.webstudio.repository.TestDeploymentReplacesContentUi",
      "method": "testDeployingAnotherProjectReplacesDeploymentContent",
      "displayName": "testDeployingAnotherProjectReplacesDeploymentContent",
      "suite": "repository",
      "shard": "shard-13",
      "status": "PASSED",
      "durationMs": 133902,
      "testCaseId": "IPBQA-33014",
      "errorMessage": "",
      "outcome": "PASSED",
      "knownIssue": "",
      "bundle": ""
    },
    {
      "class": "tests.ui.webstudio.repository.TestRepositoryTableActions",
      "method": "testRepositoryTabProperties",
      "displayName": "testRepositoryTabProperties",
      "suite": "repository",
      "shard": "shard-13",
      "status": "PASSED",
      "durationMs": 154226,
      "testCaseId": "IPBQA-29847",
      "errorMessage": "",
      "outcome": "PASSED",
      "knownIssue": "",
      "bundle": ""
    },
    {
      "class": "tests.ui.webstudio.repository.TestRepositoryTableActions",
      "method": "testTableActionButtons",
      "displayName": "testTableActionButtons",
      "suite": "repository",
      "shard": "shard-13",
      "status": "PASSED",
      "durationMs": 195656,
      "testCaseId": "EPBDS-12712",
      "errorMessage": "",
      "outcome": "PASSED",
      "knownIssue": "",
      "bundle": ""
    },
    {
      "class": "tests.ui.webstudio.repository.TestDeploymentsTabUi",
      "method": "testDeploymentsTabJourney",
      "displayName": "testDeploymentsTabJourney",
      "suite": "repository",
      "shard": "shard-14",
      "status": "PASSED",
      "durationMs": 122565,
      "testCaseId": "IPBQA-33010",
      "errorMessage": "",
      "outcome": "PASSED",
      "knownIssue": "",
      "bundle": ""
    },
    {
      "class": "tests.ui.webstudio.repository.TestMigrateBlockedByUndeclaredWorkbookUi",
      "method": "testMigrateWithheldWhenRewriteWouldWidenModules",
      "displayName": "testMigrateWithheldWhenRewriteWouldWidenModules",
      "suite": "repository",
      "shard": "shard-15",
      "status": "PASSED",
      "durationMs": 53247,
      "testCaseId": "IPBQA-33028",
      "errorMessage": "",
      "outcome": "PASSED",
      "knownIssue": "",
      "bundle": ""
    },
    {
      "class": "tests.ui.webstudio.repository.TestProjectInfoModulesFromRulesDirectoryUi",
      "method": "testModulesAreShownAndDescriptorKeepsNoDeclaredModules",
      "displayName": "testModulesAreShownAndDescriptorKeepsNoDeclaredModules",
      "suite": "repository",
      "shard": "shard-15",
      "status": "PASSED",
      "durationMs": 41093,
      "testCaseId": "EPBDS-16272",
      "errorMessage": "",
      "outcome": "PASSED",
      "knownIssue": "",
      "bundle": ""
    },
    {
      "class": "tests.ui.webstudio.repository.TestDeploymentConfigurationRepositoryConnectionOracle",
      "method": "testDeploymentConfigurationRepositoryConnectionOracleJDBC",
      "displayName": "testDeploymentConfigurationRepositoryConnectionOracleJDBC",
      "suite": "repository",
      "shard": "shard-17",
      "status": "PASSED",
      "durationMs": 100565,
      "testCaseId": "IPBQA-27365",
      "errorMessage": "",
      "outcome": "PASSED",
      "knownIssue": "",
      "bundle": ""
    },
    {
      "class": "tests.ui.webstudio.repository.TestRepositoryBrowsingFilterStatus",
      "method": "testRepositoryBrowsingFilterStatus",
      "displayName": "testRepositoryBrowsingFilterStatus",
      "suite": "repository",
      "shard": "shard-18",
      "status": "PASSED",
      "durationMs": 243477,
      "testCaseId": "IPBQA-30010",
      "errorMessage": "",
      "outcome": "PASSED",
      "knownIssue": "",
      "bundle": ""
    },
    {
      "class": "tests.ui.webstudio.repository.TestDeploymentWorkspaceUi",
      "method": "testUnknownDeploymentIdShowsNotFoundPage",
      "displayName": "testUnknownDeploymentIdShowsNotFoundPage",
      "suite": "repository",
      "shard": "shard-19",
      "status": "PASSED",
      "durationMs": 10133,
      "testCaseId": "IPBQA-33013",
      "errorMessage": "",
      "outcome": "PASSED",
      "knownIssue": "",
      "bundle": ""
    },
    {
      "class": "tests.ui.webstudio.repository.TestProjectNameValidationUi",
      "method": "testCreateProjectNameValidation",
      "displayName": "testCreateProjectNameValidation",
      "suite": "repository",
      "shard": "shard-19",
      "status": "PASSED",
      "durationMs": 123570,
      "testCaseId": "IPBQA-33036",
      "errorMessage": "",
      "outcome": "PASSED",
      "knownIssue": "",
      "bundle": ""
    },
    {
      "class": "tests.ui.webstudio.repository.TestDeploymentRepositoryIsolationUi",
      "method": "testSameDeploymentNameStaysIsolatedPerRepository",
      "displayName": "testSameDeploymentNameStaysIsolatedPerRepository",
      "suite": "repository",
      "shard": "shard-20",
      "status": "PASSED",
      "durationMs": 97723,
      "testCaseId": "IPBQA-33011",
      "errorMessage": "",
      "outcome": "PASSED",
      "knownIssue": "",
      "bundle": ""
    },
    {
      "class": "tests.ui.webstudio.repository.TestProjectDeleteClosedProjectNameUi",
      "method": "testConfirmDeleteShowsCleanNameForClosedProject",
      "displayName": "testConfirmDeleteShowsCleanNameForClosedProject",
      "suite": "repository",
      "shard": "shard-20",
      "status": "PASSED",
      "durationMs": 47970,
      "testCaseId": "EPBDS-16231",
      "errorMessage": "",
      "outcome": "PASSED",
      "knownIssue": "",
      "bundle": ""
    },
    {
      "class": "tests.ui.webstudio.rules_editor.TestCreateDataTablesFromOpenApiGetMethodWithRuntime",
      "method": "testCreateDataTablesFromOpenApiGetMethodWithRuntime",
      "displayName": "testCreateDataTablesFromOpenApiGetMethodWithRuntime",
      "suite": "rules_editor",
      "shard": "shard-01",
      "status": "PASSED",
      "durationMs": 58494,
      "testCaseId": "IPBQA-31073",
      "errorMessage": "",
      "outcome": "PASSED",
      "knownIssue": "",
      "bundle": ""
    },
    {
      "class": "tests.ui.webstudio.rules_editor.TestImportModuleNamesRetentionOnModeSwitching",
      "method": "testImportModuleNamesRetentionOnModeSwitching",
      "displayName": "testImportModuleNamesRetentionOnModeSwitching",
      "suite": "rules_editor",
      "shard": "shard-01",
      "status": "PASSED",
      "durationMs": 45699,
      "testCaseId": "IPBQA-31035",
      "errorMessage": "",
      "outcome": "PASSED",
      "knownIssue": "",
      "bundle": ""
    },
    {
      "class": "tests.ui.webstudio.rules_editor.TestImportTablesGenerationOverwriteWarning",
      "method": "testImportTablesGenerationOverwriteWarning",
      "displayName": "testImportTablesGenerationOverwriteWarning",
      "suite": "rules_editor",
      "shard": "shard-01",
      "status": "PASSED",
      "durationMs": 86440,
      "testCaseId": "IPBQA-31035",
      "errorMessage": "",
      "outcome": "PASSED",
      "knownIssue": "",
      "bundle": ""
    },
    {
      "class": "tests.ui.webstudio.rules_editor.TestOpenApiReconciliationDependentProject",
      "method": "testOpenApiReconciliationDependentProject",
      "displayName": "testOpenApiReconciliationDependentProject",
      "suite": "rules_editor",
      "shard": "shard-01",
      "status": "PASSED",
      "durationMs": 86351,
      "testCaseId": "EPBDS-13215",
      "errorMessage": "",
      "outcome": "PASSED",
      "knownIssue": "",
      "bundle": ""
    },
    {
      "class": "tests.ui.webstudio.rules_editor.TestTraceBusinessModeUi",
      "method": "testBusinessTraceShowsFiredRuleAndConditions",
      "displayName": "testBusinessTraceShowsFiredRuleAndConditions",
      "suite": "rules_editor",
      "shard": "shard-01",
      "status": "PASSED",
      "durationMs": 51097,
      "testCaseId": "IPBQA-33031",
      "errorMessage": "",
      "outcome": "PASSED",
      "knownIssue": "",
      "bundle": ""
    },
    {
      "class": "tests.ui.webstudio.rules_editor.TestCopyTableVersioningUi",
      "method": "testCopyAsBusinessDimensionVersionKeepsModuleCompilable",
      "displayName": "testCopyAsBusinessDimensionVersionKeepsModuleCompilable",
      "suite": "rules_editor",
      "shard": "shard-02",
      "status": "PASSED",
      "durationMs": 61305,
      "testCaseId": "IPBQA-31319",
      "errorMessage": "",
      "outcome": "PASSED",
      "knownIssue": "",
      "bundle": ""
    },
    {
      "class": "tests.ui.webstudio.rules_editor.TestCopyTableVersioningUi",
      "method": "testCopyAsNewVersionKeepsModuleCompilable",
      "displayName": "testCopyAsNewVersionKeepsModuleCompilable",
      "suite": "rules_editor",
      "shard": "shard-02",
      "status": "PASSED",
      "durationMs": 61172,
      "testCaseId": "EPBDS-16357",
      "errorMessage": "",
      "outcome": "PASSED",
      "knownIssue": "",
      "bundle": ""
    },
    {
      "class": "tests.ui.webstudio.rules_editor.TestImportTablesGenerationForNonOpenApiProject",
      "method": "testImportTablesGenerationForNonOpenApiProject",
      "displayName": "testImportTablesGenerationForNonOpenApiProject",
      "suite": "rules_editor",
      "shard": "shard-02",
      "status": "PASSED",
      "durationMs": 104424,
      "testCaseId": "IPBQA-31035",
      "errorMessage": "",
      "outcome": "PASSED",
      "knownIssue": "",
      "bundle": ""
    },
    {
      "class": "tests.ui.webstudio.rules_editor.TestOpenApiReconciliationMultipleMergedFiles",
      "method": "testOpenApiReconciliationMultipleMergedFiles",
      "displayName": "testOpenApiReconciliationMultipleMergedFiles",
      "suite": "rules_editor",
      "shard": "shard-02",
      "status": "PASSED",
      "durationMs": 91028,
      "testCaseId": "IPBQA-30970",
      "errorMessage": "",
      "outcome": "PASSED",
      "knownIssue": "",
      "bundle": ""
    },
    {
      "class": "tests.ui.webstudio.rules_editor.TestTraceDebuggerBreakpointsUi",
      "method": "testBreakpointSuspendsAndDebuggerCompletes",
      "displayName": "testBreakpointSuspendsAndDebuggerCompletes",
      "suite": "rules_editor",
      "shard": "shard-02",
      "status": "PASSED",
      "durationMs": 47657,
      "testCaseId": "IPBQA-33032",
      "errorMessage": "",
      "outcome": "PASSED",
      "knownIssue": "",
      "bundle": ""
    },
    {
      "class": "tests.ui.webstudio.rules_editor.TestDeleteOpenApiFileRemovesProperties",
      "method": "testDeleteOpenApiFileRemovesProperties",
      "displayName": "testDeleteOpenApiFileRemovesProperties",
      "suite": "rules_editor",
      "shard": "shard-03",
      "status": "PASSED",
      "durationMs": 39899,
      "testCaseId": "IPBQA-30678",
      "errorMessage": "",
      "outcome": "PASSED",
      "knownIssue": "",
      "bundle": ""
    },
    {
      "class": "tests.ui.webstudio.rules_editor.TestImportNewModulesWithPathEditingAndMixedScenarios",
      "method": "testImportNewModulesWithPathEditingAndMixedScenarios",
      "displayName": "testImportNewModulesWithPathEditingAndMixedScenarios",
      "suite": "rules_editor",
      "shard": "shard-03",
      "status": "PASSED",
      "durationMs": 115392,
      "testCaseId": "IPBQA-31035",
      "errorMessage": "",
      "outcome": "PASSED",
      "knownIssue": "",
      "bundle": ""
    },
    {
      "class": "tests.ui.webstudio.rules_editor.TestOpenApiReconciliationDatatypeErrors",
      "method": "testOpenApiReconciliationDatatypeErrors",
      "displayName": "testOpenApiReconciliationDatatypeErrors",
      "suite": "rules_editor",
      "shard": "shard-03",
      "status": "PASSED",
      "durationMs": 51632,
      "testCaseId": "EPBDS-13215",
      "errorMessage": "",
      "outcome": "PASSED",
      "knownIssue": "",
      "bundle": ""
    },
    {
      "class": "tests.ui.webstudio.rules_editor.TestSwitchModuleViaBreadcrumbsNavigation",
      "method": "testBreadcrumbsCorrectAfterTableDependencyNavigation",
      "displayName": "testBreadcrumbsCorrectAfterTableDependencyNavigation",
      "suite": "rules_editor",
      "shard": "shard-03",
      "status": "PASSED",
      "durationMs": 51463,
      "testCaseId": "EPBDS-12366",
      "errorMessage": "",
      "outcome": "PASSED",
      "knownIssue": "",
      "bundle": ""
    },
    {
      "class": "tests.ui.webstudio.rules_editor.TestSwitchModuleViaBreadcrumbsNavigation",
      "method": "testSwitchModuleViaBreadcrumbsNavigation",
      "displayName": "testSwitchModuleViaBreadcrumbsNavigation",
      "suite": "rules_editor",
      "shard": "shard-03",
      "status": "PASSED",
      "durationMs": 226527,
      "testCaseId": "IPBQA-31804",
      "errorMessage": "",
      "outcome": "PASSED",
      "knownIssue": "",
      "bundle": ""
    },
    {
      "class": "tests.ui.webstudio.rules_editor.TestCreateProjectFromOpenApiDefaultFormValues",
      "method": "testCreateProjectFromOpenApiDefaultFormValues",
      "displayName": "testCreateProjectFromOpenApiDefaultFormValues",
      "suite": "rules_editor",
      "shard": "shard-04",
      "status": "PASSED",
      "durationMs": 32831,
      "testCaseId": "IPBQA-30678",
      "errorMessage": "",
      "outcome": "PASSED",
      "knownIssue": "",
      "bundle": ""
    },
    {
      "class": "tests.ui.webstudio.rules_editor.TestExportProjectFunctionality",
      "method": "testExportProjectFunctionality",
      "displayName": "testExportProjectFunctionality",
      "suite": "rules_editor",
      "shard": "shard-04",
      "status": "PASSED",
      "durationMs": 450963,
      "testCaseId": "IPBQA-25697",
      "errorMessage": "",
      "outcome": "PASSED",
      "knownIssue": "",
      "bundle": ""
    },
    {
      "class": "tests.ui.webstudio.rules_editor.TestCreateTableNameValidationUi",
      "method": "testCreateTableNameValidation",
      "displayName": "testCreateTableNameValidation",
      "suite": "rules_editor",
      "shard": "shard-05",
      "status": "PASSED",
      "durationMs": 55893,
      "testCaseId": "IPBQA-33023",
      "errorMessage": "",
      "outcome": "PASSED",
      "knownIssue": "",
      "bundle": ""
    },
    {
      "class": "tests.ui.webstudio.rules_editor.TestImportOpenApiModuleNamesValidation",
      "method": "testImportOpenApiModuleNamesValidation",
      "displayName": "testImportOpenApiModuleNamesValidation",
      "suite": "rules_editor",
      "shard": "shard-05",
      "status": "PASSED",
      "durationMs": 60579,
      "testCaseId": "IPBQA-31035",
      "errorMessage": "",
      "outcome": "PASSED",
      "knownIssue": "",
      "bundle": ""
    },
    {
      "class": "tests.ui.webstudio.rules_editor.TestMethodTable",
      "method": "testMethodTable",
      "displayName": "testMethodTable",
      "suite": "rules_editor",
      "shard": "shard-05",
      "status": "PASSED",
      "durationMs": 99600,
      "testCaseId": "IPBQA-31319",
      "errorMessage": "",
      "outcome": "PASSED",
      "knownIssue": "",
      "bundle": ""
    },
    {
      "class": "tests.ui.webstudio.rules_editor.TestSimpleLookupSimpleRules",
      "method": "testSimpleLookupSimpleRules",
      "displayName": "testSimpleLookupSimpleRules",
      "suite": "rules_editor",
      "shard": "shard-05",
      "status": "PASSED",
      "durationMs": 210824,
      "testCaseId": "IPBQA-29967",
      "errorMessage": "",
      "outcome": "PASSED",
      "knownIssue": "",
      "bundle": ""
    },
    {
      "class": "tests.ui.webstudio.rules_editor.TestCreateProjectFromOpenApiFormValidation",
      "method": "testCreateProjectFromOpenApiFormValidation",
      "displayName": "testCreateProjectFromOpenApiFormValidation",
      "suite": "rules_editor",
      "shard": "shard-06",
      "status": "PASSED",
      "durationMs": 250313,
      "testCaseId": "IPBQA-30678",
      "errorMessage": "",
      "outcome": "PASSED",
      "knownIssue": "",
      "bundle": ""
    },
    {
      "class": "tests.ui.webstudio.rules_editor.TestOpenApiReconciliationSpreadsheetErrors",
      "method": "testOpenApiReconciliationSpreadsheetErrors",
      "displayName": "testOpenApiReconciliationSpreadsheetErrors",
      "suite": "rules_editor",
      "shard": "shard-06",
      "status": "PASSED",
      "durationMs": 53088,
      "testCaseId": "EPBDS-13215",
      "errorMessage": "",
      "outcome": "PASSED",
      "knownIssue": "",
      "bundle": ""
    },
    {
      "class": "tests.ui.webstudio.rules_editor.TestDefaultProperties",
      "method": "testDefaultProperties",
      "displayName": "testDefaultProperties",
      "suite": "rules_editor",
      "shard": "shard-07",
      "status": "PASSED",
      "durationMs": 49466,
      "testCaseId": "IPBQA-27254",
      "errorMessage": "",
      "outcome": "PASSED",
      "knownIssue": "",
      "bundle": ""
    },
    {
      "class": "tests.ui.webstudio.rules_editor.TestImportOpenApiReconciliationMode",
      "method": "testImportOpenApiReconciliationMode",
      "displayName": "testImportOpenApiReconciliationMode",
      "suite": "rules_editor",
      "shard": "shard-07",
      "status": "PASSED",
      "durationMs": 65120,
      "testCaseId": "IPBQA-31035",
      "errorMessage": "",
      "outcome": "PASSED",
      "knownIssue": "",
      "bundle": ""
    },
    {
      "class": "tests.ui.webstudio.rules_editor.TestModuleCategoryInheritedProperties",
      "method": "testModuleAndCategoryInheritedProperties",
      "displayName": "testModuleAndCategoryInheritedProperties",
      "suite": "rules_editor",
      "shard": "shard-07",
      "status": "PASSED",
      "durationMs": 71272,
      "testCaseId": "IPBQA-25884",
      "errorMessage": "",
      "outcome": "PASSED",
      "knownIssue": "",
      "bundle": ""
    },
    {
      "class": "tests.ui.webstudio.rules_editor.TestRestrictionsErrorMessagesForProperties",
      "method": "testRestrictionsErrorMessagesForProperties",
      "displayName": "testRestrictionsErrorMessagesForProperties",
      "suite": "rules_editor",
      "shard": "shard-07",
      "status": "PASSED",
      "durationMs": 494230,
      "testCaseId": "IPBQA-23780",
      "errorMessage": "",
      "outcome": "PASSED",
      "knownIssue": "",
      "bundle": ""
    },
    {
      "class": "tests.ui.webstudio.rules_editor.TestCreateProjectFromOpenApiYamlWithCustomModuleNames",
      "method": "testCreateProjectFromOpenApiYamlWithCustomModuleNames",
      "displayName": "testCreateProjectFromOpenApiYamlWithCustomModuleNames",
      "suite": "rules_editor",
      "shard": "shard-08",
      "status": "PASSED",
      "durationMs": 161490,
      "testCaseId": "IPBQA-30678",
      "errorMessage": "",
      "outcome": "PASSED",
      "knownIssue": "",
      "bundle": ""
    },
    {
      "class": "tests.ui.webstudio.rules_editor.TestNavigationToTable",
      "method": "testNavigationToTable",
      "displayName": "testNavigationToTable",
      "suite": "rules_editor",
      "shard": "shard-08",
      "status": "PASSED",
      "durationMs": 94889,
      "testCaseId": "IPBQA-25912",
      "errorMessage": "",
      "outcome": "PASSED",
      "knownIssue": "",
      "bundle": ""
    },
    {
      "class": "tests.ui.webstudio.rules_editor.TestSmartLookupSmartRules",
      "method": "testSmartLookupSmartRules",
      "displayName": "testSmartLookupSmartRules",
      "suite": "rules_editor",
      "shard": "shard-08",
      "status": "PASSED",
      "durationMs": 128880,
      "testCaseId": "IPBQA-29358",
      "errorMessage": "",
      "outcome": "PASSED",
      "knownIssue": "",
      "bundle": ""
    },
    {
      "class": "tests.ui.webstudio.rules_editor.TestLocalChangesModuleScopeUi",
      "method": "localChangesAreScopedToTheSelectedModule",
      "displayName": "localChangesAreScopedToTheSelectedModule",
      "suite": "rules_editor",
      "shard": "shard-09",
      "status": "PASSED",
      "durationMs": 91673,
      "testCaseId": "EPBDS-16569",
      "errorMessage": "",
      "outcome": "PASSED",
      "knownIssue": "",
      "bundle": ""
    },
    {
      "class": "tests.ui.webstudio.rules_editor.TestLocalChangesModuleScopeUi",
      "method": "restoreRollsBackOnlyTheSelectedModule",
      "displayName": "restoreRollsBackOnlyTheSelectedModule",
      "suite": "rules_editor",
      "shard": "shard-09",
      "status": "PASSED",
      "durationMs": 75006,
      "testCaseId": "EPBDS-16569",
      "errorMessage": "",
      "outcome": "PASSED",
      "knownIssue": "",
      "bundle": ""
    },
    {
      "class": "tests.ui.webstudio.rules_editor.TestCopyTableStylePreservedUi",
      "method": "testCopyPreservesTableStyle",
      "displayName": "testCopyPreservesTableStyle",
      "suite": "rules_editor",
      "shard": "shard-10",
      "status": "PASSED",
      "durationMs": 62037,
      "testCaseId": "IPBQA-33025",
      "errorMessage": "",
      "outcome": "PASSED",
      "knownIssue": "",
      "bundle": ""
    },
    {
      "class": "tests.ui.webstudio.rules_editor.TestEditingCommaSeparatedArrayValues",
      "method": "testEditingCommaSeparatedArrayValues",
      "displayName": "testEditingCommaSeparatedArrayValues",
      "suite": "rules_editor",
      "shard": "shard-10",
      "status": "PASSED",
      "durationMs": 147539,
      "testCaseId": "IPBQA-25824",
      "errorMessage": "",
      "outcome": "PASSED",
      "knownIssue": "",
      "bundle": ""
    },
    {
      "class": "tests.ui.webstudio.rules_editor.TestEditingCommaSeparatedArrayValues",
      "method": "testVerifyNoInfiniteLoading",
      "displayName": "testVerifyNoInfiniteLoading",
      "suite": "rules_editor",
      "shard": "shard-10",
      "status": "PASSED",
      "durationMs": 53439,
      "testCaseId": "EPBDS-13232",
      "errorMessage": "",
      "outcome": "PASSED",
      "knownIssue": "",
      "bundle": ""
    },
    {
      "class": "tests.ui.webstudio.rules_editor.TestProjectHasTheSameModuleInDependency",
      "method": "testProjectHasTheSameModuleInDependency",
      "displayName": "testProjectHasTheSameModuleInDependency",
      "suite": "rules_editor",
      "shard": "shard-10",
      "status": "PASSED",
      "durationMs": 113165,
      "testCaseId": "IPBQA-31701",
      "errorMessage": "",
      "outcome": "PASSED",
      "knownIssue": "",
      "bundle": ""
    },
    {
      "class": "tests.ui.webstudio.rules_editor.TestCreateProjectFromOpenApiJsonFile",
      "method": "testCreateProjectFromOpenApiJsonFile",
      "displayName": "testCreateProjectFromOpenApiJsonFile",
      "suite": "rules_editor",
      "shard": "shard-11",
      "status": "PASSED",
      "durationMs": 160297,
      "testCaseId": "IPBQA-30678",
      "errorMessage": "",
      "outcome": "PASSED",
      "knownIssue": "",
      "bundle": ""
    },
    {
      "class": "tests.ui.webstudio.rules_editor.TestLocalChangesLifecycleAndSettings",
      "method": "testAdminHistorySettings",
      "displayName": "testAdminHistorySettings",
      "suite": "rules_editor",
      "shard": "shard-11",
      "status": "PASSED",
      "durationMs": 190044,
      "testCaseId": "IPBQA-30730",
      "errorMessage": "",
      "outcome": "PASSED",
      "knownIssue": "",
      "bundle": ""
    },
    {
      "class": "tests.ui.webstudio.rules_editor.TestLocalChangesLifecycleAndSettings",
      "method": "testProjectLifecycleClearsHistory",
      "displayName": "testProjectLifecycleClearsHistory",
      "suite": "rules_editor",
      "shard": "shard-11",
      "status": "PASSED",
      "durationMs": 96954,
      "testCaseId": "IPBQA-30730",
      "errorMessage": "",
      "outcome": "PASSED",
      "knownIssue": "",
      "bundle": ""
    },
    {
      "class": "tests.ui.webstudio.rules_editor.TestEditingProperties",
      "method": "testEditingProperties",
      "displayName": "testEditingProperties",
      "suite": "rules_editor",
      "shard": "shard-12",
      "status": "PASSED",
      "durationMs": 137802,
      "testCaseId": "IPBQA-25861",
      "errorMessage": "",
      "outcome": "PASSED",
      "knownIssue": "",
      "bundle": ""
    },
    {
      "class": "tests.ui.webstudio.rules_editor.TestNewRecordWhenRegeneratingFromDifferentFile",
      "method": "testNewRecordWhenRegeneratingFromDifferentFile",
      "displayName": "testNewRecordWhenRegeneratingFromDifferentFile",
      "suite": "rules_editor",
      "shard": "shard-12",
      "status": "PASSED",
      "durationMs": 60349,
      "testCaseId": "IPBQA-31512",
      "errorMessage": "",
      "outcome": "PASSED",
      "knownIssue": "",
      "bundle": ""
    },
    {
      "class": "tests.ui.webstudio.rules_editor.TestRefreshButton",
      "method": "testRefreshButton",
      "displayName": "testRefreshButton",
      "suite": "rules_editor",
      "shard": "shard-12",
      "status": "PASSED",
      "durationMs": 58312,
      "testCaseId": "IPBQA-28382",
      "errorMessage": "",
      "outcome": "PASSED",
      "knownIssue": "",
      "bundle": ""
    },
    {
      "class": "tests.ui.webstudio.rules_editor.TestViewStackTraceFunctionality",
      "method": "testViewStackTraceFunctionality",
      "displayName": "testViewStackTraceFunctionality",
      "suite": "rules_editor",
      "shard": "shard-12",
      "status": "PASSED",
      "durationMs": 118262,
      "testCaseId": "IPBQA-25869",
      "errorMessage": "",
      "outcome": "PASSED",
      "knownIssue": "",
      "bundle": ""
    },
    {
      "class": "tests.ui.webstudio.rules_editor.TestReturnCellsMarksWithStar",
      "method": "testReturnCellsMarksWithStar",
      "displayName": "testReturnCellsMarksWithStar",
      "suite": "rules_editor",
      "shard": "shard-13",
      "status": "PASSED",
      "durationMs": 44545,
      "testCaseId": "EPBDS-8176",
      "errorMessage": "",
      "outcome": "PASSED",
      "knownIssue": "",
      "bundle": ""
    },
    {
      "class": "tests.ui.webstudio.rules_editor.TestTraceDebuggerNeverHitRuleUi",
      "method": "testBreakpointOnNeverFiredRuleDoesNotSuspend",
      "displayName": "testBreakpointOnNeverFiredRuleDoesNotSuspend",
      "suite": "rules_editor",
      "shard": "shard-13",
      "status": "PASSED",
      "durationMs": 48985,
      "testCaseId": "IPBQA-33033",
      "errorMessage": "",
      "outcome": "PASSED",
      "knownIssue": "",
      "bundle": ""
    },
    {
      "class": "tests.ui.webstudio.rules_editor.TestCompareSelectedVersions",
      "method": "testCompareSelectedVersions",
      "displayName": "testCompareSelectedVersions",
      "suite": "rules_editor",
      "shard": "shard-14",
      "status": "PASSED",
      "durationMs": 60685,
      "testCaseId": "Test030",
      "errorMessage": "",
      "outcome": "PASSED",
      "knownIssue": "",
      "bundle": ""
    },
    {
      "class": "tests.ui.webstudio.rules_editor.TestCreateTableRangeConditionUi",
      "method": "testIntegerConditionHoldsRange",
      "displayName": "testIntegerConditionHoldsRange",
      "suite": "rules_editor",
      "shard": "shard-14",
      "status": "PASSED",
      "durationMs": 60068,
      "testCaseId": "IPBQA-33024",
      "errorMessage": "",
      "outcome": "PASSED",
      "knownIssue": "",
      "bundle": ""
    },
    {
      "class": "tests.ui.webstudio.rules_editor.TestImportTablesGenerationForCorporateRatingProject",
      "method": "testImportTablesGenerationForCorporateRatingProject",
      "displayName": "testImportTablesGenerationForCorporateRatingProject",
      "suite": "rules_editor",
      "shard": "shard-14",
      "status": "PASSED",
      "durationMs": 78206,
      "testCaseId": "IPBQA-31035",
      "errorMessage": "",
      "outcome": "PASSED",
      "knownIssue": "",
      "bundle": ""
    },
    {
      "class": "tests.ui.webstudio.rules_editor.TestNoNewRecordWhenRegeneratingFromSameFile",
      "method": "testNoNewRecordWhenRegeneratingFromSameFile",
      "displayName": "testNoNewRecordWhenRegeneratingFromSameFile",
      "suite": "rules_editor",
      "shard": "shard-14",
      "status": "PASSED",
      "durationMs": 50844,
      "testCaseId": "IPBQA-31512",
      "errorMessage": "",
      "outcome": "PASSED",
      "knownIssue": "",
      "bundle": ""
    },
    {
      "class": "tests.ui.webstudio.rules_editor.TestRunContextualMenuRunAll",
      "method": "testRunAllToggleAndContextReset",
      "displayName": "testRunAllToggleAndContextReset",
      "suite": "rules_editor",
      "shard": "shard-14",
      "status": "PASSED",
      "durationMs": 48836,
      "testCaseId": "EPBDS-15969",
      "errorMessage": "",
      "outcome": "PASSED",
      "knownIssue": "",
      "bundle": ""
    },
    {
      "class": "tests.ui.webstudio.rules_editor.TestVersioningByFolders",
      "method": "testVersioningByFolders",
      "displayName": "testVersioningByFolders",
      "suite": "rules_editor",
      "shard": "shard-14",
      "status": "PASSED",
      "durationMs": 68641,
      "testCaseId": "IPBQA-30979",
      "errorMessage": "",
      "outcome": "PASSED",
      "knownIssue": "",
      "bundle": ""
    },
    {
      "class": "tests.ui.webstudio.rules_editor.TestCopyTableWizardGuaranteesUi",
      "method": "testDuplicateVersionCopyIsRejected",
      "displayName": "testDuplicateVersionCopyIsRejected",
      "suite": "rules_editor",
      "shard": "shard-15",
      "status": "PASSED",
      "durationMs": 48104,
      "testCaseId": "IPBQA-33026",
      "errorMessage": "",
      "outcome": "PASSED",
      "knownIssue": "",
      "bundle": ""
    },
    {
      "class": "tests.ui.webstudio.rules_editor.TestDetermineSpreadsheetResultCellType",
      "method": "testDetermineSpreadsheetResultCellType",
      "displayName": "testDetermineSpreadsheetResultCellType",
      "suite": "rules_editor",
      "shard": "shard-15",
      "status": "PASSED",
      "durationMs": 50326,
      "testCaseId": "IPBQA-29824",
      "errorMessage": "",
      "outcome": "PASSED",
      "knownIssue": "",
      "bundle": ""
    },
    {
      "class": "tests.ui.webstudio.rules_editor.TestImportPathValidationErrors",
      "method": "testImportPathValidationErrors",
      "displayName": "testImportPathValidationErrors",
      "suite": "rules_editor",
      "shard": "shard-15",
      "status": "PASSED",
      "durationMs": 81194,
      "testCaseId": "IPBQA-31035",
      "errorMessage": "",
      "outcome": "PASSED",
      "knownIssue": "",
      "bundle": ""
    },
    {
      "class": "tests.ui.webstudio.rules_editor.TestNoLocalChangesAfterReconciliationImport",
      "method": "testNoLocalChangesAfterReconciliationImport",
      "displayName": "testNoLocalChangesAfterReconciliationImport",
      "suite": "rules_editor",
      "shard": "shard-15",
      "status": "PASSED",
      "durationMs": 46803,
      "testCaseId": "IPBQA-31512",
      "errorMessage": "",
      "outcome": "PASSED",
      "knownIssue": "",
      "bundle": ""
    },
    {
      "class": "tests.ui.webstudio.rules_editor.TestRangeDataTypes",
      "method": "testRangeDataTypes",
      "displayName": "testRangeDataTypes",
      "suite": "rules_editor",
      "shard": "shard-15",
      "status": "PASSED",
      "durationMs": 85061,
      "testCaseId": "EPBDS-7489",
      "errorMessage": "",
      "outcome": "PASSED",
      "knownIssue": "",
      "bundle": ""
    },
    {
      "class": "tests.ui.webstudio.rules_editor.TestWorkWithDuplicateTables",
      "method": "testWorkWithDuplicateTables",
      "displayName": "testWorkWithDuplicateTables",
      "suite": "rules_editor",
      "shard": "shard-15",
      "status": "PASSED",
      "durationMs": 258730,
      "testCaseId": "IPBQA-31790",
      "errorMessage": "",
      "outcome": "PASSED",
      "knownIssue": "",
      "bundle": ""
    },
    {
      "class": "tests.ui.webstudio.rules_editor.TestImportForProjectCreatedFromTwoOpenApiFiles",
      "method": "testImportForProjectCreatedFromTwoOpenApiFiles",
      "displayName": "testImportForProjectCreatedFromTwoOpenApiFiles",
      "suite": "rules_editor",
      "shard": "shard-16",
      "status": "PASSED",
      "durationMs": 65695,
      "testCaseId": "IPBQA-31035",
      "errorMessage": "",
      "outcome": "PASSED",
      "knownIssue": "",
      "bundle": ""
    },
    {
      "class": "tests.ui.webstudio.rules_editor.TestOrderingModeTableList",
      "method": "testTableListOrdering",
      "displayName": "testTableListOrdering",
      "suite": "rules_editor",
      "shard": "shard-16",
      "status": "PASSED",
      "durationMs": 64865,
      "testCaseId": "IPBQA-32507",
      "errorMessage": "",
      "outcome": "PASSED",
      "knownIssue": "",
      "bundle": ""
    },
    {
      "class": "tests.ui.webstudio.rules_editor.TestCreateTableTypesUi",
      "method": "testCreateRulesTableViaModal",
      "displayName": "testCreateRulesTableViaModal",
      "suite": "rules_editor",
      "shard": "shard-17",
      "status": "PASSED",
      "durationMs": 58158,
      "testCaseId": "IPBQA-33020",
      "errorMessage": "",
      "outcome": "PASSED",
      "knownIssue": "",
      "bundle": ""
    },
    {
      "class": "tests.ui.webstudio.rules_editor.TestCreateTableTypesUi",
      "method": "testCreateSpreadsheetTableViaModal",
      "displayName": "testCreateSpreadsheetTableViaModal",
      "suite": "rules_editor",
      "shard": "shard-17",
      "status": "PASSED",
      "durationMs": 56129,
      "testCaseId": "IPBQA-33021",
      "errorMessage": "",
      "outcome": "PASSED",
      "knownIssue": "",
      "bundle": ""
    },
    {
      "class": "tests.ui.webstudio.rules_editor.TestCreateTableTypesUi",
      "method": "testCreateTransposedTestTableViaModal",
      "displayName": "testCreateTransposedTestTableViaModal",
      "suite": "rules_editor",
      "shard": "shard-17",
      "status": "PASSED",
      "durationMs": 56323,
      "testCaseId": "IPBQA-33022",
      "errorMessage": "",
      "outcome": "PASSED",
      "knownIssue": "",
      "bundle": ""
    },
    {
      "class": "tests.ui.webstudio.rules_editor.TestOrderingModeDefaults",
      "method": "testDefaultOrderForSingleUser",
      "displayName": "testDefaultOrderForSingleUser",
      "suite": "rules_editor",
      "shard": "shard-17",
      "status": "PASSED",
      "durationMs": 99450,
      "testCaseId": "IPBQA-32117",
      "errorMessage": "",
      "outcome": "PASSED",
      "knownIssue": "",
      "bundle": ""
    },
    {
      "class": "tests.ui.webstudio.rules_editor.TestLocalChangesCoreMechanics",
      "method": "testCoreHistoryMechanics",
      "displayName": "testCoreHistoryMechanics",
      "suite": "rules_editor",
      "shard": "shard-18",
      "status": "PASSED",
      "durationMs": 126246,
      "testCaseId": "IPBQA-30730",
      "errorMessage": "",
      "outcome": "PASSED",
      "knownIssue": "",
      "bundle": ""
    },
    {
      "class": "tests.ui.webstudio.rules_editor.TestLocalChangesCoreMechanics",
      "method": "testExtendedRestoreAndSave",
      "displayName": "testExtendedRestoreAndSave",
      "suite": "rules_editor",
      "shard": "shard-18",
      "status": "PASSED",
      "durationMs": 120221,
      "testCaseId": "IPBQA-30730",
      "errorMessage": "",
      "outcome": "PASSED",
      "knownIssue": "",
      "bundle": ""
    },
    {
      "class": "tests.ui.webstudio.rules_editor.TestImportOpenApiDialogDefaultStateForNonOpenApiProject",
      "method": "testImportOpenApiDialogDefaultStateForNonOpenApiProject",
      "displayName": "testImportOpenApiDialogDefaultStateForNonOpenApiProject",
      "suite": "rules_editor",
      "shard": "shard-19",
      "status": "PASSED",
      "durationMs": 54310,
      "testCaseId": "IPBQA-31035",
      "errorMessage": "",
      "outcome": "PASSED",
      "knownIssue": "",
      "bundle": ""
    },
    {
      "class": "tests.ui.webstudio.rules_editor.TestLocalChangesAfterTablesGenerationReImport",
      "method": "testLocalChangesAfterTablesGenerationReImport",
      "displayName": "testLocalChangesAfterTablesGenerationReImport",
      "suite": "rules_editor",
      "shard": "shard-19",
      "status": "PASSED",
      "durationMs": 114630,
      "testCaseId": "IPBQA-31512",
      "errorMessage": "",
      "outcome": "PASSED",
      "knownIssue": "",
      "bundle": ""
    },
    {
      "class": "tests.ui.webstudio.rules_editor.TestTabRevisionsInEditor",
      "method": "testTabRevisionsInEditor",
      "displayName": "testTabRevisionsInEditor",
      "suite": "rules_editor",
      "shard": "shard-19",
      "status": "PASSED",
      "durationMs": 97641,
      "testCaseId": "IPBQA-30123",
      "errorMessage": "",
      "outcome": "PASSED",
      "knownIssue": "",
      "bundle": ""
    },
    {
      "class": "tests.ui.webstudio.rules_editor.TestCreateDataTablesFromOpenApiGetMethodNoRuntime",
      "method": "testCreateDataTablesFromOpenApiGetMethodNoRuntime",
      "displayName": "testCreateDataTablesFromOpenApiGetMethodNoRuntime",
      "suite": "rules_editor",
      "shard": "shard-20",
      "status": "PASSED",
      "durationMs": 63808,
      "testCaseId": "IPBQA-31073",
      "errorMessage": "",
      "outcome": "PASSED",
      "knownIssue": "",
      "bundle": ""
    },
    {
      "class": "tests.ui.webstudio.rules_editor.TestImportCycleThroughModesForOpenApiProject",
      "method": "testImportCycleThroughModesForOpenApiProject",
      "displayName": "testImportCycleThroughModesForOpenApiProject",
      "suite": "rules_editor",
      "shard": "shard-20",
      "status": "PASSED",
      "durationMs": 116126,
      "testCaseId": "IPBQA-31035",
      "errorMessage": "",
      "outcome": "PASSED",
      "knownIssue": "",
      "bundle": ""
    },
    {
      "class": "tests.ui.webstudio.rules_editor.TestMigratedMethodFilterReloadUi",
      "method": "testProjectReloadAfterMethodFilterMigration",
      "displayName": "testProjectReloadAfterMethodFilterMigration",
      "suite": "rules_editor",
      "shard": "shard-20",
      "status": "PASSED",
      "durationMs": 80771,
      "testCaseId": "EPBDS-16275",
      "errorMessage": "",
      "outcome": "PASSED",
      "knownIssue": "",
      "bundle": ""
    },
    {
      "class": "tests.ui.webstudio.rules_editor.TestSearchOnProjectLevel",
      "method": "testAdvancedSearchOnProjectLevel",
      "displayName": "testAdvancedSearchOnProjectLevel",
      "suite": "rules_editor",
      "shard": "shard-20",
      "status": "PASSED",
      "durationMs": 143136,
      "testCaseId": "IPBQA-32590",
      "errorMessage": "",
      "outcome": "PASSED",
      "knownIssue": "",
      "bundle": ""
    },
    {
      "class": "tests.ui.webstudio.rules_editor.TestSearchOnProjectLevel",
      "method": "testSimpleSearchOnProjectLevel",
      "displayName": "testSimpleSearchOnProjectLevel",
      "suite": "rules_editor",
      "shard": "shard-20",
      "status": "PASSED",
      "durationMs": 160668,
      "testCaseId": "IPBQA-32590",
      "errorMessage": "",
      "outcome": "PASSED",
      "knownIssue": "",
      "bundle": ""
    },
    {
      "class": "tests.ui.webstudio.sso.TestProtectedBranchBypassGroupMembershipUi",
      "method": "testGroupDerivedManagerCanBypassMerge",
      "displayName": "testGroupDerivedManagerCanBypassMerge",
      "suite": "sso",
      "shard": "shard-01",
      "status": "PASSED",
      "durationMs": 12843,
      "testCaseId": "EPBDS-15960",
      "errorMessage": "",
      "outcome": "PASSED",
      "knownIssue": "",
      "bundle": ""
    },
    {
      "class": "tests.ui.webstudio.sso.TestUsersViewRolesOauth2Ui",
      "method": "testUsersViewRolesUnderOauth2",
      "displayName": "testUsersViewRolesUnderOauth2",
      "suite": "sso",
      "shard": "shard-02",
      "status": "PASSED",
      "durationMs": 22884,
      "testCaseId": "IPBQA-32789",
      "errorMessage": "",
      "outcome": "PASSED",
      "knownIssue": "",
      "bundle": ""
    },
    {
      "class": "tests.ui.webstudio.sso.TestOidcLogoutUi",
      "method": "testOidcRpInitiatedLogout",
      "displayName": "testOidcRpInitiatedLogout",
      "suite": "sso",
      "shard": "shard-09",
      "status": "PASSED",
      "durationMs": 4087,
      "testCaseId": "",
      "errorMessage": "",
      "outcome": "PASSED",
      "knownIssue": "",
      "bundle": ""
    },
    {
      "class": "tests.ui.webstudio.sso.TestSamlLogoutUi",
      "method": "testSamlSingleLogout",
      "displayName": "testSamlSingleLogout",
      "suite": "sso",
      "shard": "shard-10",
      "status": "PASSED",
      "durationMs": 4512,
      "testCaseId": "",
      "errorMessage": "",
      "outcome": "PASSED",
      "knownIssue": "",
      "bundle": ""
    },
    {
      "class": "tests.ui.webstudio.sso.TestUsersViewRolesSamlUi",
      "method": "testUsersViewRolesUnderSaml",
      "displayName": "testUsersViewRolesUnderSaml",
      "suite": "sso",
      "shard": "shard-16",
      "status": "PASSED",
      "durationMs": 29333,
      "testCaseId": "IPBQA-32788",
      "errorMessage": "",
      "outcome": "PASSED",
      "knownIssue": "",
      "bundle": ""
    },
    {
      "class": "tests.ui.webstudio.studio_issues.TestAddPropertyInSpreadSheetTable",
      "method": "testAddPropertyInSpreadSheetTable",
      "displayName": "testAddPropertyInSpreadSheetTable",
      "suite": "studio_issues",
      "shard": "shard-01",
      "status": "PASSED",
      "durationMs": 46532,
      "testCaseId": "EPBDS-7578",
      "errorMessage": "",
      "outcome": "PASSED",
      "knownIssue": "",
      "bundle": ""
    },
    {
      "class": "tests.ui.webstudio.studio_issues.TestDisplayChangedRowsCompareScreens",
      "method": "testDisplayChangedRowsLocalChangesAndRepositoryCompareScreens",
      "displayName": "testDisplayChangedRowsLocalChangesAndRepositoryCompareScreens",
      "suite": "studio_issues",
      "shard": "shard-01",
      "status": "PASSED",
      "durationMs": 79335,
      "testCaseId": "IPBQA-32105",
      "errorMessage": "",
      "outcome": "PASSED",
      "knownIssue": "",
      "bundle": ""
    },
    {
      "class": "tests.ui.webstudio.studio_issues.TestDisplayChangedRowsCompareScreens",
      "method": "testNoEqualRowsCheckboxInNonExcelResolveConflicts",
      "displayName": "testNoEqualRowsCheckboxInNonExcelResolveConflicts",
      "suite": "studio_issues",
      "shard": "shard-01",
      "status": "PASSED",
      "durationMs": 56133,
      "testCaseId": "IPBQA-32105",
      "errorMessage": "",
      "outcome": "PASSED",
      "knownIssue": "",
      "bundle": ""
    },
    {
      "class": "tests.ui.webstudio.studio_issues.TestAllBusinessVersionsDisplayWithDifferentTime",
      "method": "testAllBusinessVersionsDisplayWithDifferentTime",
      "displayName": "testAllBusinessVersionsDisplayWithDifferentTime",
      "suite": "studio_issues",
      "shard": "shard-02",
      "status": "PASSED",
      "durationMs": 43767,
      "testCaseId": "EPBDS-7708",
      "errorMessage": "",
      "outcome": "PASSED",
      "knownIssue": "",
      "bundle": ""
    },
    {
      "class": "tests.ui.webstudio.studio_issues.TestGenerateOpenApiDefaultDate",
      "method": "testGenerateOpenApiDefaultDate",
      "displayName": "testGenerateOpenApiDefaultDate",
      "suite": "studio_issues",
      "shard": "shard-02",
      "status": "PASSED",
      "durationMs": 46558,
      "testCaseId": "EPBDS-10789",
      "errorMessage": "",
      "outcome": "PASSED",
      "knownIssue": "",
      "bundle": ""
    },
    {
      "class": "tests.ui.webstudio.studio_issues.TestTraceSpreadsheetNodeDetails",
      "method": "testSpreadsheetResultNodeDetailsLoadWithoutError",
      "displayName": "testSpreadsheetResultNodeDetailsLoadWithoutError",
      "suite": "studio_issues",
      "shard": "shard-03",
      "status": "PASSED",
      "durationMs": 51646,
      "testCaseId": "EPBDS-16160",
      "errorMessage": "",
      "outcome": "PASSED",
      "knownIssue": "",
      "bundle": ""
    },
    {
      "class": "tests.ui.webstudio.studio_issues.TestArrayDeclarationIsLink",
      "method": "testArrayDeclarationIsLink",
      "displayName": "testArrayDeclarationIsLink",
      "suite": "studio_issues",
      "shard": "shard-04",
      "status": "PASSED",
      "durationMs": 47159,
      "testCaseId": "EPBDS-11230",
      "errorMessage": "",
      "outcome": "PASSED",
      "knownIssue": "",
      "bundle": ""
    },
    {
      "class": "tests.ui.webstudio.studio_issues.TestOpenApiErrorMessages",
      "method": "testOpenApiErrorMessageDisplaysInDatatypeTable",
      "displayName": "testOpenApiErrorMessageDisplaysInDatatypeTable",
      "suite": "studio_issues",
      "shard": "shard-04",
      "status": "PASSED",
      "durationMs": 46993,
      "testCaseId": "EPBDS-10789",
      "errorMessage": "",
      "outcome": "PASSED",
      "knownIssue": "",
      "bundle": ""
    },
    {
      "class": "tests.ui.webstudio.studio_issues.TestDisplayChangedRowsResolveConflicts",
      "method": "testEqualRowsCheckboxInAddingRowComparison",
      "displayName": "testEqualRowsCheckboxInAddingRowComparison",
      "suite": "studio_issues",
      "shard": "shard-05",
      "status": "PASSED",
      "durationMs": 62488,
      "testCaseId": "IPBQA-32105",
      "errorMessage": "",
      "outcome": "PASSED",
      "knownIssue": "",
      "bundle": ""
    },
    {
      "class": "tests.ui.webstudio.studio_issues.TestDisplayChangedRowsResolveConflicts",
      "method": "testEqualRowsCheckboxInResolveConflictsProjFromExcelFile",
      "displayName": "testEqualRowsCheckboxInResolveConflictsProjFromExcelFile",
      "suite": "studio_issues",
      "shard": "shard-05",
      "status": "PASSED",
      "durationMs": 58073,
      "testCaseId": "IPBQA-32105",
      "errorMessage": "",
      "outcome": "PASSED",
      "knownIssue": "",
      "bundle": ""
    },
    {
      "class": "tests.ui.webstudio.studio_issues.TestDisplayChangedRowsResolveConflicts",
      "method": "testEqualRowsCheckboxInTableDeletionComparison",
      "displayName": "testEqualRowsCheckboxInTableDeletionComparison",
      "suite": "studio_issues",
      "shard": "shard-05",
      "status": "PASSED",
      "durationMs": 102404,
      "testCaseId": "IPBQA-32105",
      "errorMessage": "",
      "outcome": "PASSED",
      "knownIssue": "",
      "bundle": ""
    },
    {
      "class": "tests.ui.webstudio.studio_issues.TestAddModuleWithPathStar",
      "method": "testAddModuleWithPathStar",
      "displayName": "testAddModuleWithPathStar",
      "suite": "studio_issues",
      "shard": "shard-08",
      "status": "PASSED",
      "durationMs": 48977,
      "testCaseId": "EPBDS-7790",
      "errorMessage": "",
      "outcome": "PASSED",
      "knownIssue": "",
      "bundle": ""
    },
    {
      "class": "tests.ui.webstudio.studio_issues.TestCompareScreenForOpenApiFiles",
      "method": "testCompareScreenForOpenApiFiles",
      "displayName": "testCompareScreenForOpenApiFiles",
      "suite": "studio_issues",
      "shard": "shard-08",
      "status": "PASSED",
      "durationMs": 96480,
      "testCaseId": "EPBDS-10548",
      "errorMessage": "",
      "outcome": "PASSED",
      "knownIssue": "",
      "bundle": ""
    },
    {
      "class": "tests.ui.webstudio.studio_issues.TestAddModuleWithPathExistingModule",
      "method": "testAddModuleWithPathExistingModule",
      "displayName": "testAddModuleWithPathExistingModule",
      "suite": "studio_issues",
      "shard": "shard-09",
      "status": "PASSED",
      "durationMs": 47075,
      "testCaseId": "EPBDS-11048",
      "errorMessage": "",
      "outcome": "PASSED",
      "knownIssue": "",
      "bundle": ""
    },
    {
      "class": "tests.ui.webstudio.studio_issues.TestConstructorNotFoundInDependentTable",
      "method": "testNoConstructorNotFoundErrorInDependentTable",
      "displayName": "testNoConstructorNotFoundErrorInDependentTable",
      "suite": "studio_issues",
      "shard": "shard-09",
      "status": "PASSED",
      "durationMs": 183579,
      "testCaseId": "EPBDS-12848",
      "errorMessage": "",
      "outcome": "PASSED",
      "knownIssue": "",
      "bundle": ""
    },
    {
      "class": "tests.ui.webstudio.studio_issues.TestAddSingleNumberIntoEmptyCell",
      "method": "testAddSingleNumberIntoEmptyCell",
      "displayName": "testAddSingleNumberIntoEmptyCell",
      "suite": "studio_issues",
      "shard": "shard-10",
      "status": "PASSED",
      "durationMs": 53707,
      "testCaseId": "EPBDS-7232",
      "errorMessage": "",
      "outcome": "PASSED",
      "knownIssue": "",
      "bundle": ""
    },
    {
      "class": "tests.ui.webstudio.studio_issues.TestClickDatatypeNotFoundError",
      "method": "testClickDatatypeNotFoundError",
      "displayName": "testClickDatatypeNotFoundError",
      "suite": "studio_issues",
      "shard": "shard-12",
      "status": "PASSED",
      "durationMs": 104838,
      "testCaseId": "EPBDS-11609",
      "errorMessage": "",
      "outcome": "PASSED",
      "knownIssue": "",
      "bundle": ""
    },
    {
      "class": "tests.ui.webstudio.studio_issues.TestAddDeleteRowWithoutSaving",
      "method": "testAddDeleteRowWithoutSaving",
      "displayName": "testAddDeleteRowWithoutSaving",
      "suite": "studio_issues",
      "shard": "shard-13",
      "status": "PASSED",
      "durationMs": 70031,
      "testCaseId": "EPBDS-7474",
      "errorMessage": "",
      "outcome": "PASSED",
      "knownIssue": "",
      "bundle": ""
    },
    {
      "class": "tests.ui.webstudio.studio_issues.TestClickOnOpenApiError",
      "method": "testClickOnOpenApiError",
      "displayName": "testClickOnOpenApiError",
      "suite": "studio_issues",
      "shard": "shard-13",
      "status": "PASSED",
      "durationMs": 43495,
      "testCaseId": "EPBDS-10252",
      "errorMessage": "",
      "outcome": "PASSED",
      "knownIssue": "",
      "bundle": ""
    },
    {
      "class": "tests.ui.webstudio.studio_issues.TestTraceIntoFileJsonRequest",
      "method": "testTraceIntoFileJsonRequest",
      "displayName": "testTraceIntoFileJsonRequest",
      "suite": "studio_issues",
      "shard": "shard-13",
      "status": "PASSED",
      "durationMs": 45276,
      "testCaseId": "EPBDS-8215",
      "errorMessage": "",
      "outcome": "PASSED",
      "knownIssue": "",
      "bundle": ""
    },
    {
      "class": "tests.ui.webstudio.studio_issues.TestAddPropertyExtraStateAppears",
      "method": "testAddPropertyExtraStateAppears",
      "displayName": "testAddPropertyExtraStateAppears",
      "suite": "studio_issues",
      "shard": "shard-14",
      "status": "PASSED",
      "durationMs": 52770,
      "testCaseId": "EPBDS-11107",
      "errorMessage": "",
      "outcome": "PASSED",
      "knownIssue": "",
      "bundle": ""
    },
    {
      "class": "tests.ui.webstudio.studio_issues.TestIncorrectTableNameWithLineBreak",
      "method": "testTableNameCorrectWithLineBreakInTitle",
      "displayName": "testTableNameCorrectWithLineBreakInTitle",
      "suite": "studio_issues",
      "shard": "shard-14",
      "status": "PASSED",
      "durationMs": 45877,
      "testCaseId": "EPBDS-13819",
      "errorMessage": "",
      "outcome": "PASSED",
      "knownIssue": "",
      "bundle": ""
    },
    {
      "class": "tests.ui.webstudio.studio_issues.TestTraceSpecialCharsDisplay",
      "method": "testSpecialCharsDisplayedCorrectlyInTrace",
      "displayName": "testSpecialCharsDisplayedCorrectlyInTrace",
      "suite": "studio_issues",
      "shard": "shard-14",
      "status": "PASSED",
      "durationMs": 48735,
      "testCaseId": "EPBDS-16151",
      "errorMessage": "",
      "outcome": "PASSED",
      "knownIssue": "",
      "bundle": ""
    },
    {
      "class": "tests.ui.webstudio.studio_issues.TestCallRuleWithSpreadsheetResultConstructor",
      "method": "testCallRuleWithSpreadsheetResultConstructor",
      "displayName": "testCallRuleWithSpreadsheetResultConstructor",
      "suite": "studio_issues",
      "shard": "shard-16",
      "status": "PASSED",
      "durationMs": 48955,
      "testCaseId": "EPBDS-12238",
      "errorMessage": "",
      "outcome": "PASSED",
      "knownIssue": "",
      "bundle": ""
    },
    {
      "class": "tests.ui.webstudio.studio_issues.TestRenameProjectFromOldRevisionConflictUi",
      "method": "testRenameFromOldRevisionOffersConflictResolution",
      "displayName": "testRenameFromOldRevisionOffersConflictResolution",
      "suite": "studio_issues",
      "shard": "shard-16",
      "status": "PASSED",
      "durationMs": 68523,
      "testCaseId": "EPBDS-16269",
      "errorMessage": "",
      "outcome": "PASSED",
      "knownIssue": "",
      "bundle": ""
    },
    {
      "class": "tests.ui.webstudio.studio_issues.TestAllStepsDisplayedInTrace",
      "method": "testAllStepsDisplayedInTrace",
      "displayName": "testAllStepsDisplayedInTrace",
      "suite": "studio_issues",
      "shard": "shard-17",
      "status": "PASSED",
      "durationMs": 52445,
      "testCaseId": "EPBDS-8215",
      "errorMessage": "",
      "outcome": "PASSED",
      "knownIssue": "",
      "bundle": ""
    },
    {
      "class": "tests.ui.webstudio.studio_issues.TestNullPointerExceptionDataTableBugFix",
      "method": "testNullPointerExceptionBugFix",
      "displayName": "testNullPointerExceptionBugFix",
      "suite": "studio_issues",
      "shard": "shard-17",
      "status": "PASSED",
      "durationMs": 58348,
      "testCaseId": "EPBDS-12614",
      "errorMessage": "",
      "outcome": "PASSED",
      "knownIssue": "",
      "bundle": ""
    },
    {
      "class": "tests.ui.webstudio.studio_issues.TestAddProperty",
      "method": "testAddProperty",
      "displayName": "testAddProperty",
      "suite": "studio_issues",
      "shard": "shard-18",
      "status": "PASSED",
      "durationMs": 50258,
      "testCaseId": "EPBDS-6964",
      "errorMessage": "",
      "outcome": "PASSED",
      "knownIssue": "",
      "bundle": ""
    },
    {
      "class": "tests.ui.webstudio.studio_issues.TestDisplayChangedRowsTableStructure",
      "method": "testEqualRowsCheckboxInTableAddingColumnComparison",
      "displayName": "testEqualRowsCheckboxInTableAddingColumnComparison",
      "suite": "studio_issues",
      "shard": "shard-18",
      "status": "PASSED",
      "durationMs": 62458,
      "testCaseId": "IPBQA-32105",
      "errorMessage": "",
      "outcome": "PASSED",
      "knownIssue": "",
      "bundle": ""
    },
    {
      "class": "tests.ui.webstudio.studio_issues.TestDisplayChangedRowsTableStructure",
      "method": "testEqualRowsCheckboxInTableAddingRowAndColumnComparison",
      "displayName": "testEqualRowsCheckboxInTableAddingRowAndColumnComparison",
      "suite": "studio_issues",
      "shard": "shard-18",
      "status": "PASSED",
      "durationMs": 63153,
      "testCaseId": "IPBQA-32105",
      "errorMessage": "",
      "outcome": "PASSED",
      "knownIssue": "",
      "bundle": ""
    },
    {
      "class": "tests.ui.webstudio.studio_issues.TestDisplayChangedRowsTableStructure",
      "method": "testEqualRowsCheckboxInTableCreationComparison",
      "displayName": "testEqualRowsCheckboxInTableCreationComparison",
      "suite": "studio_issues",
      "shard": "shard-18",
      "status": "PASSED",
      "durationMs": 106064,
      "testCaseId": "IPBQA-32105",
      "errorMessage": "",
      "outcome": "PASSED",
      "knownIssue": "",
      "bundle": ""
    },
    {
      "class": "tests.ui.webstudio.studio_issues.TestAddElementToCollectionSet",
      "method": "testAddElementToCollectionSet",
      "displayName": "testAddElementToCollectionSet",
      "suite": "studio_issues",
      "shard": "shard-19",
      "status": "PASSED",
      "durationMs": 47741,
      "testCaseId": "EPBDS-10142",
      "errorMessage": "",
      "outcome": "PASSED",
      "knownIssue": "",
      "bundle": ""
    },
    {
      "class": "tests.ui.webstudio.studio_issues.TestClassCastException",
      "method": "testClassCastException",
      "displayName": "testClassCastException",
      "suite": "studio_issues",
      "shard": "shard-19",
      "status": "PASSED",
      "durationMs": 47791,
      "testCaseId": "EPBDS-7018",
      "errorMessage": "",
      "outcome": "PASSED",
      "knownIssue": "",
      "bundle": ""
    },
    {
      "class": "tests.ui.webstudio.studio_issues.TestSpecialSymbolsWarningMessages",
      "method": "testSpecialSymbolsWarningMessages",
      "displayName": "testSpecialSymbolsWarningMessages",
      "suite": "studio_issues",
      "shard": "shard-19",
      "status": "PASSED",
      "durationMs": 52511,
      "testCaseId": "IPBQA-32176",
      "errorMessage": "",
      "outcome": "PASSED",
      "knownIssue": "",
      "bundle": ""
    },
    {
      "class": "tests.ui.webstudio.studio_smoke.TestFileAddDelete",
      "method": "testFileAddDelete",
      "displayName": "testFileAddDelete",
      "suite": "studio_smoke",
      "shard": "shard-01",
      "status": "PASSED",
      "durationMs": 85729,
      "testCaseId": "NTC",
      "errorMessage": "",
      "outcome": "PASSED",
      "knownIssue": "",
      "bundle": ""
    },
    {
      "class": "tests.ui.webstudio.studio_smoke.TestACLRunBenchmarkSystemAction",
      "method": "testRunAndBenchmarkVisibleForContributor",
      "displayName": "testRunAndBenchmarkVisibleForContributor",
      "suite": "studio_smoke",
      "shard": "shard-02",
      "status": "PASSED",
      "durationMs": 72908,
      "testCaseId": "EPBDS-15712",
      "errorMessage": "",
      "outcome": "PASSED",
      "knownIssue": "",
      "bundle": ""
    },
    {
      "class": "tests.ui.webstudio.studio_smoke.TestACLRunBenchmarkSystemAction",
      "method": "testRunAndBenchmarkVisibleForManager",
      "displayName": "testRunAndBenchmarkVisibleForManager",
      "suite": "studio_smoke",
      "shard": "shard-02",
      "status": "PASSED",
      "durationMs": 72830,
      "testCaseId": "EPBDS-15712",
      "errorMessage": "",
      "outcome": "PASSED",
      "knownIssue": "",
      "bundle": ""
    },
    {
      "class": "tests.ui.webstudio.studio_smoke.TestACLRunBenchmarkSystemAction",
      "method": "testRunAndBenchmarkVisibleForViewer",
      "displayName": "testRunAndBenchmarkVisibleForViewer",
      "suite": "studio_smoke",
      "shard": "shard-02",
      "status": "PASSED",
      "durationMs": 73389,
      "testCaseId": "EPBDS-15712",
      "errorMessage": "",
      "outcome": "PASSED",
      "knownIssue": "",
      "bundle": ""
    },
    {
      "class": "tests.ui.webstudio.studio_smoke.TestSingleModeProfileEditUi",
      "method": "testSingleModeProfileEditPersists",
      "displayName": "testSingleModeProfileEditPersists",
      "suite": "studio_smoke",
      "shard": "shard-03",
      "status": "PASSED",
      "durationMs": 30237,
      "testCaseId": "EPBDS-16220",
      "errorMessage": "",
      "outcome": "PASSED",
      "knownIssue": "",
      "bundle": ""
    },
    {
      "class": "tests.ui.webstudio.studio_smoke.TestACLDeployWithDeployRepo",
      "method": "testDeployNotVisibleForViewerOnBothRepos",
      "displayName": "testDeployNotVisibleForViewerOnBothRepos",
      "suite": "studio_smoke",
      "shard": "shard-04",
      "status": "PASSED",
      "durationMs": 71795,
      "testCaseId": "EPBDS-15712",
      "errorMessage": "",
      "outcome": "PASSED",
      "knownIssue": "",
      "bundle": ""
    },
    {
      "class": "tests.ui.webstudio.studio_smoke.TestACLDeployWithDeployRepo",
      "method": "testDeployVisibleForAdminWithDeployRepo",
      "displayName": "testDeployVisibleForAdminWithDeployRepo",
      "suite": "studio_smoke",
      "shard": "shard-04",
      "status": "PASSED",
      "durationMs": 39690,
      "testCaseId": "EPBDS-15712",
      "errorMessage": "",
      "outcome": "PASSED",
      "knownIssue": "",
      "bundle": ""
    },
    {
      "class": "tests.ui.webstudio.studio_smoke.TestACLDeployWithDeployRepo",
      "method": "testDeployVisibleForContributorWithDeployRepoAccess",
      "displayName": "testDeployVisibleForContributorWithDeployRepoAccess",
      "suite": "studio_smoke",
      "shard": "shard-04",
      "status": "PASSED",
      "durationMs": 70407,
      "testCaseId": "EPBDS-15712",
      "errorMessage": "",
      "outcome": "PASSED",
      "knownIssue": "",
      "bundle": ""
    },
    {
      "class": "tests.ui.webstudio.studio_smoke.TestACLDeployWithDeployRepo",
      "method": "testDeployVisibleForViewerOnDesignWithContributorOnDeployRepo",
      "displayName": "testDeployVisibleForViewerOnDesignWithContributorOnDeployRepo",
      "suite": "studio_smoke",
      "shard": "shard-04",
      "status": "PASSED",
      "durationMs": 71320,
      "testCaseId": "EPBDS-15712",
      "errorMessage": "",
      "outcome": "PASSED",
      "knownIssue": "",
      "bundle": ""
    },
    {
      "class": "tests.ui.webstudio.studio_smoke.TestProjectTagsCreationNonExistingType",
      "method": "testNonExistingTagTypeHandling",
      "displayName": "testNonExistingTagTypeHandling",
      "suite": "studio_smoke",
      "shard": "shard-05",
      "status": "PASSED",
      "durationMs": 70055,
      "testCaseId": "IPBQA-32767",
      "errorMessage": "",
      "outcome": "PASSED",
      "knownIssue": "",
      "bundle": ""
    },
    {
      "class": "tests.ui.webstudio.studio_smoke.TestACLManagePermission",
      "method": "testContributorCannotAccessAdministration",
      "displayName": "testContributorCannotAccessAdministration",
      "suite": "studio_smoke",
      "shard": "shard-06",
      "status": "PASSED",
      "durationMs": 69885,
      "testCaseId": "EPBDS-15712",
      "errorMessage": "",
      "outcome": "PASSED",
      "knownIssue": "",
      "bundle": ""
    },
    {
      "class": "tests.ui.webstudio.studio_smoke.TestACLManagePermission",
      "method": "testUserWithNoRolesHasNoAccess",
      "displayName": "testUserWithNoRolesHasNoAccess",
      "suite": "studio_smoke",
      "shard": "shard-06",
      "status": "PASSED",
      "durationMs": 74802,
      "testCaseId": "EPBDS-15712",
      "errorMessage": "",
      "outcome": "PASSED",
      "knownIssue": "",
      "bundle": ""
    },
    {
      "class": "tests.ui.webstudio.studio_smoke.TestACLManagePermission",
      "method": "testViewerCannotAccessAdministration",
      "displayName": "testViewerCannotAccessAdministration",
      "suite": "studio_smoke",
      "shard": "shard-06",
      "status": "PASSED",
      "durationMs": 69400,
      "testCaseId": "EPBDS-15712",
      "errorMessage": "",
      "outcome": "PASSED",
      "knownIssue": "",
      "bundle": ""
    },
    {
      "class": "tests.ui.webstudio.studio_smoke.TestFillTagsForProject",
      "method": "testFillTagsForProjectFromTemplate",
      "displayName": "testFillTagsForProjectFromTemplate",
      "suite": "studio_smoke",
      "shard": "shard-07",
      "status": "PASSED",
      "durationMs": 46928,
      "testCaseId": "EPBDS-15749",
      "errorMessage": "",
      "outcome": "PASSED",
      "knownIssue": "",
      "bundle": ""
    },
    {
      "class": "tests.ui.webstudio.studio_smoke.TestSupportedRepositories",
      "method": "testSupportedRepositories",
      "displayName": "testSupportedRepositories",
      "suite": "studio_smoke",
      "shard": "shard-07",
      "status": "PASSED",
      "durationMs": 31568,
      "testCaseId": "IPBQA-29276",
      "errorMessage": "",
      "outcome": "PASSED",
      "knownIssue": "",
      "bundle": ""
    },
    {
      "class": "tests.ui.webstudio.studio_smoke.TestACLDeploySystemAction",
      "method": "testDeployNotVisibleForDesignViewerWithoutDeployRepo",
      "displayName": "testDeployNotVisibleForDesignViewerWithoutDeployRepo",
      "suite": "studio_smoke",
      "shard": "shard-08",
      "status": "PASSED",
      "durationMs": 66812,
      "testCaseId": "EPBDS-15712",
      "errorMessage": "",
      "outcome": "PASSED",
      "knownIssue": "",
      "bundle": ""
    },
    {
      "class": "tests.ui.webstudio.studio_smoke.TestACLDeploySystemAction",
      "method": "testDeployNotVisibleWhenDeployRepoAccessIsViewerOnly",
      "displayName": "testDeployNotVisibleWhenDeployRepoAccessIsViewerOnly",
      "suite": "studio_smoke",
      "shard": "shard-08",
      "status": "PASSED",
      "durationMs": 65740,
      "testCaseId": "EPBDS-15712",
      "errorMessage": "",
      "outcome": "PASSED",
      "knownIssue": "",
      "bundle": ""
    },
    {
      "class": "tests.ui.webstudio.studio_smoke.TestProjectTagsCreationFromWorkspace",
      "method": "testCreateProjectFromWorkspaceWithTags",
      "displayName": "testCreateProjectFromWorkspaceWithTags",
      "suite": "studio_smoke",
      "shard": "shard-08",
      "status": "PASSED",
      "durationMs": 68838,
      "testCaseId": "IPBQA-32767",
      "errorMessage": "",
      "outcome": "PASSED",
      "knownIssue": "",
      "bundle": ""
    },
    {
      "class": "tests.ui.webstudio.studio_smoke.TestAdminUsersSearchUi",
      "method": "testUsersTableFiltersBySearch",
      "displayName": "testUsersTableFiltersBySearch",
      "suite": "studio_smoke",
      "shard": "shard-09",
      "status": "PASSED",
      "durationMs": 92641,
      "testCaseId": "IPBQA-33038",
      "errorMessage": "",
      "outcome": "PASSED",
      "knownIssue": "",
      "bundle": ""
    },
    {
      "class": "tests.ui.webstudio.studio_smoke.TestProtectedBranchBypassSecuritySettingsUi",
      "method": "testAllowBypassCheckboxRenderTogglePersistence",
      "displayName": "testAllowBypassCheckboxRenderTogglePersistence",
      "suite": "studio_smoke",
      "shard": "shard-09",
      "status": "PASSED",
      "durationMs": 57492,
      "testCaseId": "EPBDS-15960",
      "errorMessage": "",
      "outcome": "PASSED",
      "knownIssue": "",
      "bundle": ""
    },
    {
      "class": "tests.ui.webstudio.studio_smoke.TestAdminEmail",
      "method": "testAdminEmail",
      "displayName": "testAdminEmail",
      "suite": "studio_smoke",
      "shard": "shard-11",
      "status": "PASSED",
      "durationMs": 60419,
      "testCaseId": "IPBQA-32798",
      "errorMessage": "",
      "outcome": "PASSED",
      "knownIssue": "",
      "bundle": ""
    },
    {
      "class": "tests.ui.webstudio.studio_smoke.TestPersonalAccessTokenCopyToClipboardUi",
      "method": "testGeneratedTokenIsCopiedToClipboardInMultiUserMode",
      "displayName": "testGeneratedTokenIsCopiedToClipboardInMultiUserMode",
      "suite": "studio_smoke",
      "shard": "shard-11",
      "status": "PASSED",
      "durationMs": 37656,
      "testCaseId": "EPBDS-16264",
      "errorMessage": "",
      "outcome": "PASSED",
      "knownIssue": "",
      "bundle": ""
    },
    {
      "class": "tests.ui.webstudio.studio_smoke.TestTableIcons",
      "method": "testTableIcons",
      "displayName": "testTableIcons",
      "suite": "studio_smoke",
      "shard": "shard-11",
      "status": "PASSED",
      "durationMs": 57758,
      "testCaseId": "IPBQA-25719",
      "errorMessage": "",
      "outcome": "PASSED",
      "knownIssue": "",
      "bundle": ""
    },
    {
      "class": "tests.ui.webstudio.studio_smoke.TestACLContributorRole",
      "method": "testACLContributorRoleOnProjectLevel",
      "displayName": "testACLContributorRoleOnProjectLevel",
      "suite": "studio_smoke",
      "shard": "shard-12",
      "status": "PASSED",
      "durationMs": 109180,
      "testCaseId": "EPBDS-15712",
      "errorMessage": "",
      "outcome": "PASSED",
      "knownIssue": "",
      "bundle": ""
    },
    {
      "class": "tests.ui.webstudio.studio_smoke.TestACLContributorRole",
      "method": "testACLContributorRoleOnRepositoryLevel",
      "displayName": "testACLContributorRoleOnRepositoryLevel",
      "suite": "studio_smoke",
      "shard": "shard-12",
      "status": "PASSED",
      "durationMs": 78867,
      "testCaseId": "EPBDS-15712",
      "errorMessage": "",
      "outcome": "PASSED",
      "knownIssue": "",
      "bundle": ""
    },
    {
      "class": "tests.ui.webstudio.studio_smoke.TestACLContributorRole",
      "method": "testACLContributorVsViewerComparison",
      "displayName": "testACLContributorVsViewerComparison",
      "suite": "studio_smoke",
      "shard": "shard-12",
      "status": "PASSED",
      "durationMs": 115331,
      "testCaseId": "EPBDS-15712",
      "errorMessage": "",
      "outcome": "PASSED",
      "knownIssue": "",
      "bundle": ""
    },
    {
      "class": "tests.ui.webstudio.studio_smoke.TestACLParsedGroupsUserView",
      "method": "testDesignRepoRolesVisibleInUserEditForm",
      "displayName": "testDesignRepoRolesVisibleInUserEditForm",
      "suite": "studio_smoke",
      "shard": "shard-13",
      "status": "PASSED",
      "durationMs": 52875,
      "testCaseId": "EPBDS-15712",
      "errorMessage": "",
      "outcome": "PASSED",
      "knownIssue": "",
      "bundle": ""
    },
    {
      "class": "tests.ui.webstudio.studio_smoke.TestACLParsedGroupsUserView",
      "method": "testProjectLevelRolesVisibleInUserEditForm",
      "displayName": "testProjectLevelRolesVisibleInUserEditForm",
      "suite": "studio_smoke",
      "shard": "shard-13",
      "status": "PASSED",
      "durationMs": 43047,
      "testCaseId": "EPBDS-15712",
      "errorMessage": "",
      "outcome": "PASSED",
      "knownIssue": "",
      "bundle": ""
    },
    {
      "class": "tests.ui.webstudio.studio_smoke.TestPersonalAccessTokenMultiUserUi",
      "method": "testPersonalAccessTokenAuthenticatesRestInMultiUserMode",
      "displayName": "testPersonalAccessTokenAuthenticatesRestInMultiUserMode",
      "suite": "studio_smoke",
      "shard": "shard-13",
      "status": "PASSED",
      "durationMs": 35040,
      "testCaseId": "EPBDS-16168",
      "errorMessage": "",
      "outcome": "PASSED",
      "knownIssue": "",
      "bundle": ""
    },
    {
      "class": "tests.ui.webstudio.studio_smoke.TestSingleModeAuthUi",
      "method": "testSingleModeAutoAuthentication",
      "displayName": "testSingleModeAutoAuthentication",
      "suite": "studio_smoke",
      "shard": "shard-13",
      "status": "PASSED",
      "durationMs": 10666,
      "testCaseId": "",
      "errorMessage": "",
      "outcome": "PASSED",
      "knownIssue": "",
      "bundle": ""
    },
    {
      "class": "tests.ui.webstudio.studio_smoke.TestAddDeleteDesignRepository",
      "method": "testAddDeleteDesignRepository",
      "displayName": "testAddDeleteDesignRepository",
      "suite": "studio_smoke",
      "shard": "shard-14",
      "status": "PASSED",
      "durationMs": 178945,
      "testCaseId": "IPBQA-30682",
      "errorMessage": "",
      "outcome": "PASSED",
      "knownIssue": "",
      "bundle": ""
    },
    {
      "class": "tests.ui.webstudio.studio_smoke.TestACLLockUnlockDeprecated",
      "method": "testLockUnlockNotPresentInUI",
      "displayName": "testLockUnlockNotPresentInUI",
      "suite": "studio_smoke",
      "shard": "shard-15",
      "status": "PASSED",
      "durationMs": 49336,
      "testCaseId": "EPBDS-15712",
      "errorMessage": "",
      "outcome": "PASSED",
      "knownIssue": "",
      "bundle": ""
    },
    {
      "class": "tests.ui.webstudio.studio_smoke.TestAdminUserSettings",
      "method": "testUserSettingsAndDetails",
      "displayName": "testUserSettingsAndDetails",
      "suite": "studio_smoke",
      "shard": "shard-15",
      "status": "PASSED",
      "durationMs": 426760,
      "testCaseId": "IPBQA-31293",
      "errorMessage": "",
      "outcome": "PASSED",
      "knownIssue": "",
      "bundle": ""
    },
    {
      "class": "tests.ui.webstudio.studio_smoke.TestACLUserManagementAndRepositoryRoles",
      "method": "testACLUserManagementAndRepositoryRoles",
      "displayName": "testACLUserManagementAndRepositoryRoles",
      "suite": "studio_smoke",
      "shard": "shard-16",
      "status": "PASSED",
      "durationMs": 284607,
      "testCaseId": "IPBQA-32912",
      "errorMessage": "",
      "outcome": "PASSED",
      "knownIssue": "",
      "bundle": ""
    },
    {
      "class": "tests.ui.webstudio.studio_smoke.TestACLNoAccessWarning",
      "method": "testNoAccessUserSeesEmptyRepositoryAndNoCreateLink",
      "displayName": "testNoAccessUserSeesEmptyRepositoryAndNoCreateLink",
      "suite": "studio_smoke",
      "shard": "shard-17",
      "status": "PASSED",
      "durationMs": 74022,
      "testCaseId": "EPBDS-15712",
      "errorMessage": "",
      "outcome": "PASSED",
      "knownIssue": "",
      "bundle": ""
    },
    {
      "class": "tests.ui.webstudio.studio_smoke.TestACLNoAccessWarning",
      "method": "testWarningDisappearsAfterRoleAssignment",
      "displayName": "testWarningDisappearsAfterRoleAssignment",
      "suite": "studio_smoke",
      "shard": "shard-17",
      "status": "PASSED",
      "durationMs": 123311,
      "testCaseId": "EPBDS-15712",
      "errorMessage": "",
      "outcome": "PASSED",
      "knownIssue": "",
      "bundle": ""
    },
    {
      "class": "tests.ui.webstudio.studio_smoke.TestProjectTagsCreationNonExistingValue",
      "method": "testNonExistingTagValueHandling",
      "displayName": "testNonExistingTagValueHandling",
      "suite": "studio_smoke",
      "shard": "shard-18",
      "status": "PASSED",
      "durationMs": 73608,
      "testCaseId": "IPBQA-32767",
      "errorMessage": "",
      "outcome": "PASSED",
      "knownIssue": "",
      "bundle": ""
    },
    {
      "class": "tests.ui.webstudio.studio_smoke.TestACLProjectLevelRoles",
      "method": "testACLProjectLevelRoles",
      "displayName": "testACLProjectLevelRoles",
      "suite": "studio_smoke",
      "shard": "shard-19",
      "status": "PASSED",
      "durationMs": 222173,
      "testCaseId": "IPBQA-32912",
      "errorMessage": "",
      "outcome": "PASSED",
      "knownIssue": "",
      "bundle": ""
    },
    {
      "class": "tests.ui.webstudio.studio_smoke.CreateDataTypeTableTest",
      "method": "testCreateDataTypeTable",
      "displayName": "testCreateDataTypeTable",
      "suite": "studio_smoke",
      "shard": "shard-20",
      "status": "PASSED",
      "durationMs": 57297,
      "testCaseId": "NTC",
      "errorMessage": "",
      "outcome": "PASSED",
      "knownIssue": "",
      "bundle": ""
    },
    {
      "class": "tests.ui.webstudio.studio_smoke.TestAdminSystemSettingsDBValidation",
      "method": "testSystemSettingsDBValidation",
      "displayName": "testSystemSettingsDBValidation",
      "suite": "studio_smoke",
      "shard": "shard-20",
      "status": "PASSED",
      "durationMs": 155304,
      "testCaseId": "IPBQA-30651",
      "errorMessage": "",
      "outcome": "PASSED",
      "knownIssue": "",
      "bundle": ""
    },
    {
      "class": "tests.ui.webservice.TestWebservicesDeployUI",
      "method": "testWebservicesDeployUi",
      "displayName": "testWebservicesDeployUi",
      "suite": "webservice",
      "shard": "shard-03",
      "status": "PASSED",
      "durationMs": 915,
      "testCaseId": "IPBQA-28640",
      "errorMessage": "",
      "outcome": "PASSED",
      "knownIssue": "",
      "bundle": ""
    },
    {
      "class": "tests.ui.webservice.TestDeployProjectsWithoutServiceNameInRulesDeploy",
      "method": "testDeployProjectsWithoutServiceNameInRulesDeploy",
      "displayName": "testDeployProjectsWithoutServiceNameInRulesDeploy",
      "suite": "webservice",
      "shard": "shard-06",
      "status": "PASSED",
      "durationMs": 3308,
      "testCaseId": "EPBDS-9881",
      "errorMessage": "",
      "outcome": "PASSED",
      "knownIssue": "",
      "bundle": ""
    },
    {
      "class": "tests.ui.webservice.TestWebservicesSwaggerUi",
      "method": "testWebservicesSwaggerUi",
      "displayName": "testWebservicesSwaggerUi",
      "suite": "webservice",
      "shard": "shard-10",
      "status": "PASSED",
      "durationMs": 1730,
      "testCaseId": "IPBQA-32142",
      "errorMessage": "",
      "outcome": "PASSED",
      "knownIssue": "",
      "bundle": ""
    },
    {
      "class": "tests.ui.webservice.TestRuleServicesNewUI",
      "method": "testRuleServicesNewUI",
      "displayName": "testRuleServicesNewUI",
      "suite": "webservice",
      "shard": "shard-16",
      "status": "PASSED",
      "durationMs": 9973,
      "testCaseId": "EPBDS-14196",
      "errorMessage": "",
      "outcome": "PASSED",
      "knownIssue": "",
      "bundle": ""
    },
    {
      "class": "tests.ui.webservice.TestProjectStatus",
      "method": "testProjectStatus",
      "displayName": "testProjectStatus",
      "suite": "webservice",
      "shard": "shard-17",
      "status": "PASSED",
      "durationMs": 381,
      "testCaseId": "IPBQA-29488",
      "errorMessage": "",
      "outcome": "PASSED",
      "knownIssue": "",
      "bundle": ""
    },
    {
      "class": "tests.ui.webservice.TestWebservicesGitRepo",
      "method": "testWebservicesGitRepo",
      "displayName": "testWebservicesGitRepo",
      "suite": "webservice",
      "shard": "shard-18",
      "status": "PASSED",
      "durationMs": 1243,
      "testCaseId": "EPBDS-14497",
      "errorMessage": "",
      "outcome": "PASSED",
      "knownIssue": "",
      "bundle": ""
    },
    {
      "class": "tests.ui.webservice.TestRuleServiceS3DeployClasspathJarProperty",
      "method": "testRuleServiceS3DeployClasspathJarProperty",
      "displayName": "testRuleServiceS3DeployClasspathJarProperty",
      "suite": "webservice",
      "shard": "shard-20",
      "status": "PASSED",
      "durationMs": 51160,
      "testCaseId": "IPBQA-32605",
      "errorMessage": "",
      "outcome": "PASSED",
      "knownIssue": "",
      "bundle": ""
    }
  ]
}
